{"text_format":"1","workbook":"xlsx","n_sheets":24,"sheets":["Formulae","Error Log","Debug","SAPJOB","SAPTAL","SAPRANGES","SAPMSG","REFEQUIP","FLCONTYPE","ELIST","Tarrif_Config","PROJECT","POLE","COLUMN","PILLAR","ASSM","SLCP","STREETLIGHT","DSUB (GRND)","DSUB (POLE)","SWITCHGEAR","HV_LV Switches","TRANSFORMER","Errors"],"not_rendered":{"charts":0,"images":1,"macros":1,"external_links":1,"defined_names":220,"comments":2,"pivot_tables":0},"unopened":[],"bounds":{"document_bytes":16777216,"sheet_cells":100000,"rows_first":2000,"rows_last":500,"rows_between":2000,"halvings":0,"cell_chars":16384,"cell_head_chars":4096},"cells_cut":0,"cells_raw":0,"read":"whole","date_system":"1900"}

{"sheet":"Formulae","index":0,"n_rows":169,"n_cols":6,"rows_kept":169,"cut":false,"hidden":true,"merged":[]}
[null,"FLOC_CONST_D"]
[null,"FLOC_TOT_D",null,null,"<>"]
[null,"REF_EQ_D",null,null,"="]
[null,"EQ_TOT_D",null,null,"*"]
[null,"STREETNAME"]
[null,"SUBURB"]
[null,"LOCATIONNOTES"]
[]
[]
["The Sheet","The Field","The Attribute Value","Auto Populated","The mathematical operator","Name of tag\nSpecified in column F of the asset sheet"]
["Sheet","Source Code","Coded Value","Description","Operator","Tag"]
["POLE","EQ_TOT_D","PL_WOODPL","Wood Pole","<>","WoodPole"]
[]
["DSUB (GRND)","FLOC_TOT_D","DS_COTSUB","Cottage Substation","<>","Sub4"]
["DSUB (GRND)","FLOC_TOT_D","DS_INDSUB","Indoor Substation","<>","Sub4"]
["DSUB (GRND)","FLOC_TOT_D","DS_GNDSUB","Ground Substation","<>","Sub4"]
[]
["DSUB (GRND)","FLOC_TOT_D","DS_PADSUB","Padmount Substation","<>","Sub5"]
["DSUB (GRND)","FLOC_TOT_D","DS_CUBSW","Cubicle Swtchng Stn","<>","Sub5"]
[]
["DSUB (GRND)","FLOC_TOT_D","DS_HVCSUB","Private Sub/HVC","<>","Sub1"]
["DSUB (GRND)","FLOC_TOT_D","DS_REGSUB","Regulating Sub - GD","<>","Sub1"]
[]
["DSUB (GRND)","FLOC_TOT_D","DS_GNDSUB","Ground Substation","<>","Sub2"]
["DSUB (GRND)","FLOC_TOT_D","DS_COTSUB","Cottage Substation","<>","Sub2"]
["DSUB (GRND)","FLOC_TOT_D","DS_HVCSUB","Private Sub/HVC","<>","Sub2"]
["DSUB (GRND)","FLOC_TOT_D","DS_INDSUB","Indoor Substation","<>","Sub2"]
["DSUB (GRND)","FLOC_TOT_D","DS_INDSW","Indoor Swtchng Stn","<>","Sub2"]
["DSUB (GRND)","FLOC_TOT_D","DS_KSKSUB","Kiosk Substation","<>","Sub2"]
["DSUB (GRND)","FLOC_TOT_D","DS_REGSUB","Regulating Sub - GD","<>","Sub2"]
[]
["DSUB (GRND)","FLOC_TOT_D","DS_CUBSW","Cubicle Swtchng Stn","<>","Sub3"]
["DSUB (GRND)","FLOC_TOT_D","DS_GNDSUB","Ground Substation","<>","Sub3"]
["DSUB (GRND)","FLOC_TOT_D","DS_HVCSUB","Private Sub/HVC","<>","Sub3"]
["DSUB (GRND)","FLOC_TOT_D","DS_PADSUB","Padmount Substation","<>","Sub3"]
["DSUB (GRND)","FLOC_TOT_D","DS_REGSUB","Regulating Sub - GD","<>","Sub3"]
[]
["TRANSFORMER","FLOC_TOT_D","TX_AUTOTX","Auto Transformer","=","TRF1"]
[]
["TRANSFORMER","FLOC_TOT_D","TX_VREGTX","Voltage Reg Trf","<>","TRF2"]
[]
["TRANSFORMER","FLOC_TOT_D","TX_AUTOTX","Auto Transformer","<>","TRF3"]
[]
["SWITCHGEAR","FLOC_TOT_D","CB_CBLV","Circuit breaker - LV","=","Sw2"]
[]
["SWITCHGEAR","FLOC_TOT_D","DG_LVBUSB","LV Busbar","=","Sw3"]
[]
["SWITCHGEAR","FLOC_TOT_D","DG_HVBUSB","HV Busbar","=","Sw3"]
[]
["SWITCHGEAR","FLOC_TOT_D","CB_CBHV","Circuit breaker - HV","=","noEQ"]
[]
["SWITCHGEAR","FLOC_TOT_D","CB_CBHV","Circuit breaker - HV","=","Sw2"]
[]
["SWITCHGEAR","FLOC_TOT_D","DG_LVBUSB","LV Busbar","=","Sw4"]
[]
["SWITCHGEAR","FLOC_TOT_D","DG_HVBUSB","HV Busbar","=","Sw4"]
[]
["SWITCHGEAR","FLOC_TOT_D","DG_LVSWGR","LV Switchgear","=","noEQ"]
[]
["SWITCHGEAR","FLOC_TOT_D","DG_LVSWGR","LV Switchgear","=","Sw2"]
[]
["SWITCHGEAR","FLOC_TOT_D","DG_LVSWGR","LV Switchgear","<>","SwLV"]
[]
["SWITCHGEAR","FLOC_TOT_D","CB_CBLV","Circuit breaker - LV","=","Sw2"]
[]
["HV_LV Switches","FLOC_TOT_D","SW_LBS","Load Break Switch","<>","hv1"]
["HV_LV Switches","FLOC_TOT_D","SW_SECT","Sectionaliser","<>","hv1"]
["HV_LV Switches","FLOC_TOT_D","SW_RECL","Recloser","<>","hv1"]
[]
["HV_LV Switches","FLOC_TOT_D","SW_ABS","Air Break Switch","<>","hv2"]
[]
["HV_LV Switches","FLOC_TOT_D","SW_ABS","Air Break Switch","=","hv3"]
[]
["HV_LV Switches","FLOC_TOT_D","SW_LBS","Load Break Switch","=","hv3"]
[]
["HV_LV Switches","FLOC_TOT_D","SW_ABS","Air Break Switch","<>","oph"]
["HV_LV Switches","FLOC_TOT_D","SW_LBS","Load Break Switch","<>","oph"]
[]
["HV_LV Switches","FLOC_TOT_D","SW_SECT","Sectionaliser","=","hv4"]
[]
["HV_LV Switches","FLOC_TOT_D","SW_RECL","Recloser","<>","rec"]
[]
["HV_LV Switches","FLOC_TOT_D","SW_RECL","Recloser","=","hv5"]
[]
["HV_LV Switches","FLOC_TOT_D","SW_DOFPL","Drop Out Fuse Pole","=","hv6"]
[]
["HV_LV Switches","FLOC_TOT_D","SW_FUSAVR","Fuse Saver","=","hv6"]
[]
["HV_LV Switches","FLOC_TOT_D","SW_USL","Under Slung Link","=","hv7"]
[]
["HV_LV Switches","FLOC_TOT_D","SW_LINK","Link","=","hv8"]
[]
["HV_LV Switches","FLOC_TOT_D","DG_SWFSPL","Sw Fuse - LV - PL","=","hv8"]
[]
["HV_LV Switches","FLOC_TOT_D","SW_LVLINK","LV Links","=","hv8"]
[]
["HV_LV Switches","FLOC_TOT_D","DG_SWFSLV","Switch Fuse - LV","=","hv8"]
[]
["HV_LV Switches","FLOC_TOT_D","SW_LINKF","Link/Fuse","=","hv8"]
[]
["HV_LV Switches","FLOC_TOT_D","CB_CBLVPL","CB - LV - PL","=","hv8"]
[]
["HV_LV Switches","FLOC_TOT_D","DG_DCLVPL","Direct Con - LV - PL","=","hv8"]
[]
["HV_LV Switches","FLOC_TOT_D","DG_ISNLLV","Isol No Load Br - LV","=","hv8"]
[]
["HV_LV Switches","FLOC_TOT_D","DG_ISLVGD","Isol/Disc - LV - GD","=","hv8"]
[]
["HV_LV Switches","FLOC_TOT_D","DG_SWLBLV","Sw Load Break - LV","=","hv8"]
[]
["HV_LV Switches","FLOC_TOT_D","DG_DCLVGD","Direct Con - LV - GD","=","hv8"]
[]
["HV_LV Switches","FLOC_TOT_D","DG_KNFLV","Knife Switch - LV","=","hv8"]
[]
["HV_LV Switches","FLOC_TOT_D","DG_SWUNT","HV Switch Unit","=","noEQ"]
[]
["HV_LV Switches","FLOC_TOT_D","DG_ERSWD","Dist Earth Switch","=","noEQ"]
[]
["HV_LV Switches","FLOC_TOT_D","DG_SWFUNT","HV Switch/Fuse Unit","=","noEQ"]
[]
["HV_LV Switches","FLOC_TOT_D","DG_GENLK","Generator Link - LV","=","hvX"]
[]
["HV_LV Switches","FLOC_TOT_D","DG_SSWBLV","Steel Encl Swbd - LV","=","hv8"]
[]
["HV_LV Switches","FLOC_TOT_D","SW_DOFSUB","Drop Out Fuse PL Sub","=","hvDF"]
[]
["POLE","FLOC_TOT_D",null,null,"*","noReturn"]
[]
["DSUB (GRND)","FLOC_TOT_D",null,null,"*","noReturn"]
[]
["ASSM","FLOC_TOT_D",null,null,"*","noReturn"]
[]
["DSUB (POLE)","FLOC_TOT_D",null,null,"*","noReturn"]
[]
["STREETLIGHT","FLOC_TOT_D",null,null,"*","noReturn"]
[]
["COLUMN","FLOC_TOT_D",null,null,"*","noReturn"]
[]
["PILLAR","FLOC_TOT_D",null,null,"*","noReturn"]
[]
["SLCP","FLOC_TOT_D",null,null,"*","noReturn"]
[]
["SWITCHGEAR","FLOC_TOT_D",null,null,"*","noReturn"]
[]
["HV_LV Switches","FLOC_TOT_D",null,null,"*","noReturn"]
[]
["TRANSFORMER","FLOC_TOT_D",null,null,"*","noReturn"]
[]
[]
[]
[]
[]
[]
[]
[]
[]
[]
[]
[]
[]
[]
[]
[]
[]
[]
[]
[]
[]
[null,null,null,null,null,""]

{"sheet":"Error Log","index":1,"n_rows":237,"n_cols":4,"rows_kept":237,"cut":false,"hidden":true,"merged":[]}
["Equip Class","Equip No.","Asset No.","Error Message"]
["Range address $K$4 6",null,null,"Proc SetValidations - Application-defined or object-defined error"]
["Range address $K$4 6",null,null,"Proc SetValidations - Application-defined or object-defined error"]
["POLE - LIST",8,11,"Proc Update_DVs - Object variable or With block variable not set"]
["Range address $K$8 3",{"$f":"TAL_FLOC_CONST_D","v":{"$error":"#NAME?"}},null,"Proc SetValidations - Application-defined or object-defined error"]
["Range address $K$8 3",{"$f":"TAL_FLOC_CONST_D","v":{"$error":"#NAME?"}},null,"Proc SetValidations - Application-defined or object-defined error"]
["Range address $K$8 3",{"$f":"TAL_FLOC_CONST_D","v":{"$error":"#NAME?"}},null,"Proc SetValidations - Application-defined or object-defined error"]
["Range address $K$55 6",null,null,"Proc SetValidations - Application-defined or object-defined error"]
["Range address $K$55 6",null,null,"Proc SetValidations - Application-defined or object-defined error"]
["POLE - LIST",59,11,"Proc Update_DVs - Object variable or With block variable not set"]
["Range address $K$59 3",{"$f":"TAL_FLOC_CONST_D","v":{"$error":"#NAME?"}},null,"Proc SetValidations - Application-defined or object-defined error"]
["Range address $K$59 3",{"$f":"TAL_FLOC_CONST_D","v":{"$error":"#NAME?"}},null,"Proc SetValidations - Application-defined or object-defined error"]
["Range address $K$59 3",{"$f":"TAL_FLOC_CONST_D","v":{"$error":"#NAME?"}},null,"Proc SetValidations - Application-defined or object-defined error"]
["COLUMN - LIST",8,11,"Proc Update_DVs - Object variable or With block variable not set"]
["Range address $K$8 3",{"$f":"TAL_FLOC_CONST_D","v":{"$error":"#NAME?"}},null,"Proc SetValidations - Application-defined or object-defined error"]
["Range address $K$8 3",{"$f":"TAL_FLOC_CONST_D","v":{"$error":"#NAME?"}},null,"Proc SetValidations - Application-defined or object-defined error"]
["Range address $K$8 3",{"$f":"TAL_FLOC_CONST_D","v":{"$error":"#NAME?"}},null,"Proc SetValidations - Application-defined or object-defined error"]
["Range address $K$50 6",null,null,"Proc SetValidations - Application-defined or object-defined error"]
["Range address $K$50 6",null,null,"Proc SetValidations - Application-defined or object-defined error"]
["COLUMN - LIST",54,11,"Proc Update_DVs - Object variable or With block variable not set"]
["Range address $K$54 3",{"$f":"TAL_FLOC_CONST_D","v":{"$error":"#NAME?"}},null,"Proc SetValidations - Application-defined or object-defined error"]
["Range address $K$54 3",{"$f":"TAL_FLOC_CONST_D","v":{"$error":"#NAME?"}},null,"Proc SetValidations - Application-defined or object-defined error"]
["Range address $K$54 3",{"$f":"TAL_FLOC_CONST_D","v":{"$error":"#NAME?"}},null,"Proc SetValidations - Application-defined or object-defined error"]
["PILLAR - LIST",8,11,"Proc Update_DVs - Object variable or With block variable not set"]
["Range address $K$8 3",{"$f":"TAL_FLOC_CONST_D","v":{"$error":"#NAME?"}},null,"Proc SetValidations - Application-defined or object-defined error"]
["Range address $K$8 3",{"$f":"TAL_FLOC_CONST_D","v":{"$error":"#NAME?"}},null,"Proc SetValidations - Application-defined or object-defined error"]
["Range address $K$8 3",{"$f":"TAL_FLOC_CONST_D","v":{"$error":"#NAME?"}},null,"Proc SetValidations - Application-defined or object-defined error"]
["Range address $K$46 6",null,null,"Proc SetValidations - Application-defined or object-defined error"]
["Range address $K$46 6",null,null,"Proc SetValidations - Application-defined or object-defined error"]
["PILLAR - LIST",50,11,"Proc Update_DVs - Object variable or With block variable not set"]
["Range address $K$50 3",{"$f":"TAL_FLOC_CONST_D","v":{"$error":"#NAME?"}},null,"Proc SetValidations - Application-defined or object-defined error"]
["Range address $K$50 3",{"$f":"TAL_FLOC_CONST_D","v":{"$error":"#NAME?"}},null,"Proc SetValidations - Application-defined or object-defined error"]
["Range address $K$50 3",{"$f":"TAL_FLOC_CONST_D","v":{"$error":"#NAME?"}},null,"Proc SetValidations - Application-defined or object-defined error"]
["PILLAR - LIST",8,12,"Proc Update_DVs - Object variable or With block variable not set"]
["Range address $L$8 3",{"$f":"TAL_FLOC_CONST_D","v":{"$error":"#NAME?"}},null,"Proc SetValidations - Application-defined or object-defined error"]
["Range address $L$8 3",{"$f":"TAL_FLOC_CONST_D","v":{"$error":"#NAME?"}},null,"Proc SetValidations - Application-defined or object-defined error"]
["Range address $L$8 3",{"$f":"TAL_FLOC_CONST_D","v":{"$error":"#NAME?"}},null,"Proc SetValidations - Application-defined or object-defined error"]
["Range address $L$46 6",null,null,"Proc SetValidations - Application-defined or object-defined error"]
["Range address $L$46 6",null,null,"Proc SetValidations - Application-defined or object-defined error"]
["PILLAR - LIST",50,12,"Proc Update_DVs - Object variable or With block variable not set"]
["Range address $L$50 3",{"$f":"TAL_FLOC_CONST_D","v":{"$error":"#NAME?"}},null,"Proc SetValidations - Application-defined or object-defined error"]
["Range address $L$50 3",{"$f":"TAL_FLOC_CONST_D","v":{"$error":"#NAME?"}},null,"Proc SetValidations - Application-defined or object-defined error"]
["Range address $L$50 3",{"$f":"TAL_FLOC_CONST_D","v":{"$error":"#NAME?"}},null,"Proc SetValidations - Application-defined or object-defined error"]
["Range address $K$4 6",null,null,"Proc SetValidations - Application-defined or object-defined error"]
["Range address $K$4 6",null,null,"Proc SetValidations - Application-defined or object-defined error"]
["ASSM - LIST",8,11,"Proc Update_DVs - Object variable or With block variable not set"]
["Range address $K$8 3",{"$f":"TAL_FLOC_CONST_D","v":{"$error":"#NAME?"}},null,"Proc SetValidations - Application-defined or object-defined error"]
["Range address $K$8 3",{"$f":"TAL_FLOC_CONST_D","v":{"$error":"#NAME?"}},null,"Proc SetValidations - Application-defined or object-defined error"]
["Range address $K$8 3",{"$f":"TAL_FLOC_CONST_D","v":{"$error":"#NAME?"}},null,"Proc SetValidations - Application-defined or object-defined error"]
["Range address $L$4 6",null,null,"Proc SetValidations - Application-defined or object-defined error"]
["Range address $L$4 6",null,null,"Proc SetValidations - Application-defined or object-defined error"]
["ASSM - LIST",8,12,"Proc Update_DVs - Object variable or With block variable not set"]
["Range address $L$8 3",{"$f":"TAL_FLOC_CONST_D","v":{"$error":"#NAME?"}},null,"Proc SetValidations - Application-defined or object-defined error"]
["Range address $L$8 3",{"$f":"TAL_FLOC_CONST_D","v":{"$error":"#NAME?"}},null,"Proc SetValidations - Application-defined or object-defined error"]
["Range address $L$8 3",{"$f":"TAL_FLOC_CONST_D","v":{"$error":"#NAME?"}},null,"Proc SetValidations - Application-defined or object-defined error"]
["Range address $M$4 6",null,null,"Proc SetValidations - Application-defined or object-defined error"]
["Range address $M$4 6",null,null,"Proc SetValidations - Application-defined or object-defined error"]
["ASSM - LIST",8,13,"Proc Update_DVs - Object variable or With block variable not set"]
["Range address $M$8 3",{"$f":"TAL_FLOC_CONST_D","v":{"$error":"#NAME?"}},null,"Proc SetValidations - Application-defined or object-defined error"]
["Range address $M$8 3",{"$f":"TAL_FLOC_CONST_D","v":{"$error":"#NAME?"}},null,"Proc SetValidations - Application-defined or object-defined error"]
["Range address $M$8 3",{"$f":"TAL_FLOC_CONST_D","v":{"$error":"#NAME?"}},null,"Proc SetValidations - Application-defined or object-defined error"]
["Range address $N$4 6",null,null,"Proc SetValidations - Application-defined or object-defined error"]
["Range address $N$4 6",null,null,"Proc SetValidations - Application-defined or object-defined error"]
["ASSM - LIST",8,14,"Proc Update_DVs - Object variable or With block variable not set"]
["Range address $N$8 3",{"$f":"TAL_FLOC_CONST_D","v":{"$error":"#NAME?"}},null,"Proc SetValidations - Application-defined or object-defined error"]
["Range address $N$8 3",{"$f":"TAL_FLOC_CONST_D","v":{"$error":"#NAME?"}},null,"Proc SetValidations - Application-defined or object-defined error"]
["Range address $N$8 3",{"$f":"TAL_FLOC_CONST_D","v":{"$error":"#NAME?"}},null,"Proc SetValidations - Application-defined or object-defined error"]
["STREETLIGHT - LIST",8,11,"Proc Update_DVs - Object variable or With block variable not set"]
["Range address $K$8 3",{"$f":"TAL_FLOC_CONST_D","v":{"$error":"#NAME?"}},null,"Proc SetValidations - Application-defined or object-defined error"]
["Range address $K$8 3",{"$f":"TAL_FLOC_CONST_D","v":{"$error":"#NAME?"}},null,"Proc SetValidations - Application-defined or object-defined error"]
["Range address $K$8 3",{"$f":"TAL_FLOC_CONST_D","v":{"$error":"#NAME?"}},null,"Proc SetValidations - Application-defined or object-defined error"]
["Range address $K$4 6",null,null,"Proc SetValidations - Application-defined or object-defined error"]
["Range address $K$4 6",null,null,"Proc SetValidations - Application-defined or object-defined error"]
["DSUB (GRND) - LIST",8,11,"Proc Update_DVs - Object variable or With block variable not set"]
["Range address $K$8 3",{"$f":"TAL_FLOC_CONST_D","v":{"$error":"#NAME?"}},null,"Proc SetValidations - Application-defined or object-defined error"]
["Range address $K$8 3",{"$f":"TAL_FLOC_CONST_D","v":{"$error":"#NAME?"}},null,"Proc SetValidations - Application-defined or object-defined error"]
["Range address $K$8 3",{"$f":"TAL_FLOC_CONST_D","v":{"$error":"#NAME?"}},null,"Proc SetValidations - Application-defined or object-defined error"]
["Range address $L$4 6",null,null,"Proc SetValidations - Application-defined or object-defined error"]
["Range address $L$4 6",null,null,"Proc SetValidations - Application-defined or object-defined error"]
["DSUB (GRND) - LIST",8,12,"Proc Update_DVs - Object variable or With block variable not set"]
["Range address $L$8 3",{"$f":"TAL_FLOC_CONST_D","v":{"$error":"#NAME?"}},null,"Proc SetValidations - Application-defined or object-defined error"]
["Range address $L$8 3",{"$f":"TAL_FLOC_CONST_D","v":{"$error":"#NAME?"}},null,"Proc SetValidations - Application-defined or object-defined error"]
["Range address $L$8 3",{"$f":"TAL_FLOC_CONST_D","v":{"$error":"#NAME?"}},null,"Proc SetValidations - Application-defined or object-defined error"]
["Range address $K$4 6",null,null,"Proc SetValidations - Application-defined or object-defined error"]
["Range address $K$4 6",null,null,"Proc SetValidations - Application-defined or object-defined error"]
["SWITCHGEAR - LIST",8,11,"Proc Update_DVs - Object variable or With block variable not set"]
["Range address $K$8 3",{"$f":"TAL_FLOC_CONST_D","v":{"$error":"#NAME?"}},null,"Proc SetValidations - Application-defined or object-defined error"]
["Range address $K$8 3",{"$f":"TAL_FLOC_CONST_D","v":{"$error":"#NAME?"}},null,"Proc SetValidations - Application-defined or object-defined error"]
["Range address $K$8 3",{"$f":"TAL_FLOC_CONST_D","v":{"$error":"#NAME?"}},null,"Proc SetValidations - Application-defined or object-defined error"]
["SWITCHGEAR - LIST",38,11,"Proc Update_DVs - Object variable or With block variable not set"]
["Range address $K$38 3",{"$f":"TAL_FAULT_RATING","v":{"$error":"#NAME?"}},null,"Proc SetValidations - Application-defined or object-defined error"]
["Range address $K$38 3",{"$f":"TAL_FAULT_RATING","v":{"$error":"#NAME?"}},null,"Proc SetValidations - Application-defined or object-defined error"]
["Range address $K$38 3",{"$f":"TAL_FAULT_RATING","v":{"$error":"#NAME?"}},null,"Proc SetValidations - Application-defined or object-defined error"]
["SWITCHGEAR - LIST",44,11,"Proc Update_DVs - Object variable or With block variable not set"]
["Range address $K$44 3",{"$f":"TAL_RATING_VOLTS","v":{"$error":"#NAME?"}},null,"Proc SetValidations - Application-defined or object-defined error"]
["Range address $K$44 3",{"$f":"TAL_RATING_VOLTS","v":{"$error":"#NAME?"}},null,"Proc SetValidations - Application-defined or object-defined error"]
["Range address $K$44 3",{"$f":"TAL_RATING_VOLTS","v":{"$error":"#NAME?"}},null,"Proc SetValidations - Application-defined or object-defined error"]
["Range address $L$4 6",null,null,"Proc SetValidations - Application-defined or object-defined error"]
["Range address $L$4 6",null,null,"Proc SetValidations - Application-defined or object-defined error"]
["SWITCHGEAR - LIST",8,12,"Proc Update_DVs - Object variable or With block variable not set"]
["Range address $L$8 3",{"$f":"TAL_FLOC_CONST_D","v":{"$error":"#NAME?"}},null,"Proc SetValidations - Application-defined or object-defined error"]
["Range address $L$8 3",{"$f":"TAL_FLOC_CONST_D","v":{"$error":"#NAME?"}},null,"Proc SetValidations - Application-defined or object-defined error"]
["Range address $L$8 3",{"$f":"TAL_FLOC_CONST_D","v":{"$error":"#NAME?"}},null,"Proc SetValidations - Application-defined or object-defined error"]
["SWITCHGEAR - LIST",38,12,"Proc Update_DVs - Object variable or With block variable not set"]
["Range address $L$38 3",{"$f":"TAL_FAULT_RATING","v":{"$error":"#NAME?"}},null,"Proc SetValidations - Application-defined or object-defined error"]
["Range address $L$38 3",{"$f":"TAL_FAULT_RATING","v":{"$error":"#NAME?"}},null,"Proc SetValidations - Application-defined or object-defined error"]
["Range address $L$38 3",{"$f":"TAL_FAULT_RATING","v":{"$error":"#NAME?"}},null,"Proc SetValidations - Application-defined or object-defined error"]
["SWITCHGEAR - LIST",44,12,"Proc Update_DVs - Object variable or With block variable not set"]
["Range address $L$44 3",{"$f":"TAL_RATING_VOLTS","v":{"$error":"#NAME?"}},null,"Proc SetValidations - Application-defined or object-defined error"]
["Range address $L$44 3",{"$f":"TAL_RATING_VOLTS","v":{"$error":"#NAME?"}},null,"Proc SetValidations - Application-defined or object-defined error"]
["Range address $L$44 3",{"$f":"TAL_RATING_VOLTS","v":{"$error":"#NAME?"}},null,"Proc SetValidations - Application-defined or object-defined error"]
["Range address $M$4 6",null,null,"Proc SetValidations - Application-defined or object-defined error"]
["Range address $M$4 6",null,null,"Proc SetValidations - Application-defined or object-defined error"]
["SWITCHGEAR - LIST",8,13,"Proc Update_DVs - Object variable or With block variable not set"]
["Range address $M$8 3",{"$f":"TAL_FLOC_CONST_D","v":{"$error":"#NAME?"}},null,"Proc SetValidations - Application-defined or object-defined error"]
["Range address $M$8 3",{"$f":"TAL_FLOC_CONST_D","v":{"$error":"#NAME?"}},null,"Proc SetValidations - Application-defined or object-defined error"]
["Range address $M$8 3",{"$f":"TAL_FLOC_CONST_D","v":{"$error":"#NAME?"}},null,"Proc SetValidations - Application-defined or object-defined error"]
["SWITCHGEAR - LIST",38,13,"Proc Update_DVs - Object variable or With block variable not set"]
["Range address $M$38 3",{"$f":"TAL_FAULT_RATING","v":{"$error":"#NAME?"}},null,"Proc SetValidations - Application-defined or object-defined error"]
["Range address $M$38 3",{"$f":"TAL_FAULT_RATING","v":{"$error":"#NAME?"}},null,"Proc SetValidations - Application-defined or object-defined error"]
["Range address $M$38 3",{"$f":"TAL_FAULT_RATING","v":{"$error":"#NAME?"}},null,"Proc SetValidations - Application-defined or object-defined error"]
["SWITCHGEAR - LIST",44,13,"Proc Update_DVs - Object variable or With block variable not set"]
["Range address $M$44 3",{"$f":"TAL_RATING_VOLTS","v":{"$error":"#NAME?"}},null,"Proc SetValidations - Application-defined or object-defined error"]
["Range address $M$44 3",{"$f":"TAL_RATING_VOLTS","v":{"$error":"#NAME?"}},null,"Proc SetValidations - Application-defined or object-defined error"]
["Range address $M$44 3",{"$f":"TAL_RATING_VOLTS","v":{"$error":"#NAME?"}},null,"Proc SetValidations - Application-defined or object-defined error"]
["Range address $N$4 6",null,null,"Proc SetValidations - Application-defined or object-defined error"]
["Range address $N$4 6",null,null,"Proc SetValidations - Application-defined or object-defined error"]
["SWITCHGEAR - LIST",8,14,"Proc Update_DVs - Object variable or With block variable not set"]
["Range address $N$8 3",{"$f":"TAL_FLOC_CONST_D","v":{"$error":"#NAME?"}},null,"Proc SetValidations - Application-defined or object-defined error"]
["Range address $N$8 3",{"$f":"TAL_FLOC_CONST_D","v":{"$error":"#NAME?"}},null,"Proc SetValidations - Application-defined or object-defined error"]
["Range address $N$8 3",{"$f":"TAL_FLOC_CONST_D","v":{"$error":"#NAME?"}},null,"Proc SetValidations - Application-defined or object-defined error"]
["SWITCHGEAR - LIST",38,14,"Proc Update_DVs - Object variable or With block variable not set"]
["Range address $N$38 3",{"$f":"TAL_FAULT_RATING","v":{"$error":"#NAME?"}},null,"Proc SetValidations - Application-defined or object-defined error"]
["Range address $N$38 3",{"$f":"TAL_FAULT_RATING","v":{"$error":"#NAME?"}},null,"Proc SetValidations - Application-defined or object-defined error"]
["Range address $N$38 3",{"$f":"TAL_FAULT_RATING","v":{"$error":"#NAME?"}},null,"Proc SetValidations - Application-defined or object-defined error"]
["SWITCHGEAR - LIST",44,14,"Proc Update_DVs - Object variable or With block variable not set"]
["Range address $N$44 3",{"$f":"TAL_RATING_VOLTS","v":{"$error":"#NAME?"}},null,"Proc SetValidations - Application-defined or object-defined error"]
["Range address $N$44 3",{"$f":"TAL_RATING_VOLTS","v":{"$error":"#NAME?"}},null,"Proc SetValidations - Application-defined or object-defined error"]
["Range address $N$44 3",{"$f":"TAL_RATING_VOLTS","v":{"$error":"#NAME?"}},null,"Proc SetValidations - Application-defined or object-defined error"]
["Range address $K$4 6",null,null,"Proc SetValidations - Application-defined or object-defined error"]
["Range address $K$4 6",null,null,"Proc SetValidations - Application-defined or object-defined error"]
["HV_LV Switches - LIST",8,11,"Proc Update_DVs - Object variable or With block variable not set"]
["Range address $K$8 3",{"$f":"TAL_FLOC_CONST_D","v":{"$error":"#NAME?"}},null,"Proc SetValidations - Application-defined or object-defined error"]
["Range address $K$8 3",{"$f":"TAL_FLOC_CONST_D","v":{"$error":"#NAME?"}},null,"Proc SetValidations - Application-defined or object-defined error"]
["Range address $K$8 3",{"$f":"TAL_FLOC_CONST_D","v":{"$error":"#NAME?"}},null,"Proc SetValidations - Application-defined or object-defined error"]
["HV_LV Switches - LIST",42,11,"Proc Update_DVs - Object variable or With block variable not set"]
["Range address $K$42 3",{"$f":"TAL_RATING_VOLTS","v":{"$error":"#NAME?"}},null,"Proc SetValidations - Application-defined or object-defined error"]
["Range address $K$42 3",{"$f":"TAL_RATING_VOLTS","v":{"$error":"#NAME?"}},null,"Proc SetValidations - Application-defined or object-defined error"]
["Range address $K$42 3",{"$f":"TAL_RATING_VOLTS","v":{"$error":"#NAME?"}},null,"Proc SetValidations - Application-defined or object-defined error"]
["Range address $L$4 6",null,null,"Proc SetValidations - Application-defined or object-defined error"]
["Range address $L$4 6",null,null,"Proc SetValidations - Application-defined or object-defined error"]
["HV_LV Switches - LIST",8,12,"Proc Update_DVs - Object variable or With block variable not set"]
["Range address $L$8 3",{"$f":"TAL_FLOC_CONST_D","v":{"$error":"#NAME?"}},null,"Proc SetValidations - Application-defined or object-defined error"]
["Range address $L$8 3",{"$f":"TAL_FLOC_CONST_D","v":{"$error":"#NAME?"}},null,"Proc SetValidations - Application-defined or object-defined error"]
["Range address $L$8 3",{"$f":"TAL_FLOC_CONST_D","v":{"$error":"#NAME?"}},null,"Proc SetValidations - Application-defined or object-defined error"]
["HV_LV Switches - LIST",42,12,"Proc Update_DVs - Object variable or With block variable not set"]
["Range address $L$42 3",{"$f":"TAL_RATING_VOLTS","v":{"$error":"#NAME?"}},null,"Proc SetValidations - Application-defined or object-defined error"]
["Range address $L$42 3",{"$f":"TAL_RATING_VOLTS","v":{"$error":"#NAME?"}},null,"Proc SetValidations - Application-defined or object-defined error"]
["Range address $L$42 3",{"$f":"TAL_RATING_VOLTS","v":{"$error":"#NAME?"}},null,"Proc SetValidations - Application-defined or object-defined error"]
["Range address $M$4 6",null,null,"Proc SetValidations - Application-defined or object-defined error"]
["Range address $M$4 6",null,null,"Proc SetValidations - Application-defined or object-defined error"]
["HV_LV Switches - LIST",8,13,"Proc Update_DVs - Object variable or With block variable not set"]
["Range address $M$8 3",{"$f":"TAL_FLOC_CONST_D","v":{"$error":"#NAME?"}},null,"Proc SetValidations - Application-defined or object-defined error"]
["Range address $M$8 3",{"$f":"TAL_FLOC_CONST_D","v":{"$error":"#NAME?"}},null,"Proc SetValidations - Application-defined or object-defined error"]
["Range address $M$8 3",{"$f":"TAL_FLOC_CONST_D","v":{"$error":"#NAME?"}},null,"Proc SetValidations - Application-defined or object-defined error"]
["HV_LV Switches - LIST",42,13,"Proc Update_DVs - Object variable or With block variable not set"]
["Range address $M$42 3",{"$f":"TAL_RATING_VOLTS","v":{"$error":"#NAME?"}},null,"Proc SetValidations - Application-defined or object-defined error"]
["Range address $M$42 3",{"$f":"TAL_RATING_VOLTS","v":{"$error":"#NAME?"}},null,"Proc SetValidations - Application-defined or object-defined error"]
["Range address $M$42 3",{"$f":"TAL_RATING_VOLTS","v":{"$error":"#NAME?"}},null,"Proc SetValidations - Application-defined or object-defined error"]
["Range address $N$4 6",null,null,"Proc SetValidations - Application-defined or object-defined error"]
["Range address $N$4 6",null,null,"Proc SetValidations - Application-defined or object-defined error"]
["HV_LV Switches - LIST",8,14,"Proc Update_DVs - Object variable or With block variable not set"]
["Range address $N$8 3",{"$f":"TAL_FLOC_CONST_D","v":{"$error":"#NAME?"}},null,"Proc SetValidations - Application-defined or object-defined error"]
["Range address $N$8 3",{"$f":"TAL_FLOC_CONST_D","v":{"$error":"#NAME?"}},null,"Proc SetValidations - Application-defined or object-defined error"]
["Range address $N$8 3",{"$f":"TAL_FLOC_CONST_D","v":{"$error":"#NAME?"}},null,"Proc SetValidations - Application-defined or object-defined error"]
["HV_LV Switches - LIST",42,14,"Proc Update_DVs - Object variable or With block variable not set"]
["Range address $N$42 3",{"$f":"TAL_RATING_VOLTS","v":{"$error":"#NAME?"}},null,"Proc SetValidations - Application-defined or object-defined error"]
["Range address $N$42 3",{"$f":"TAL_RATING_VOLTS","v":{"$error":"#NAME?"}},null,"Proc SetValidations - Application-defined or object-defined error"]
["Range address $N$42 3",{"$f":"TAL_RATING_VOLTS","v":{"$error":"#NAME?"}},null,"Proc SetValidations - Application-defined or object-defined error"]
["Range address $O$4 6",null,null,"Proc SetValidations - Application-defined or object-defined error"]
["Range address $O$4 6",null,null,"Proc SetValidations - Application-defined or object-defined error"]
["HV_LV Switches - LIST",8,15,"Proc Update_DVs - Object variable or With block variable not set"]
["Range address $O$8 3",{"$f":"TAL_FLOC_CONST_D","v":{"$error":"#NAME?"}},null,"Proc SetValidations - Application-defined or object-defined error"]
["Range address $O$8 3",{"$f":"TAL_FLOC_CONST_D","v":{"$error":"#NAME?"}},null,"Proc SetValidations - Application-defined or object-defined error"]
["Range address $O$8 3",{"$f":"TAL_FLOC_CONST_D","v":{"$error":"#NAME?"}},null,"Proc SetValidations - Application-defined or object-defined error"]
["HV_LV Switches - LIST",42,15,"Proc Update_DVs - Object variable or With block variable not set"]
["Range address $O$42 3",{"$f":"TAL_RATING_VOLTS","v":{"$error":"#NAME?"}},null,"Proc SetValidations - Application-defined or object-defined error"]
["Range address $O$42 3",{"$f":"TAL_RATING_VOLTS","v":{"$error":"#NAME?"}},null,"Proc SetValidations - Application-defined or object-defined error"]
["Range address $O$42 3",{"$f":"TAL_RATING_VOLTS","v":{"$error":"#NAME?"}},null,"Proc SetValidations - Application-defined or object-defined error"]
["Range address $P$4 6",null,null,"Proc SetValidations - Application-defined or object-defined error"]
["Range address $P$4 6",null,null,"Proc SetValidations - Application-defined or object-defined error"]
["HV_LV Switches - LIST",8,16,"Proc Update_DVs - Object variable or With block variable not set"]
["Range address $P$8 3",{"$f":"TAL_FLOC_CONST_D","v":{"$error":"#NAME?"}},null,"Proc SetValidations - Application-defined or object-defined error"]
["Range address $P$8 3",{"$f":"TAL_FLOC_CONST_D","v":{"$error":"#NAME?"}},null,"Proc SetValidations - Application-defined or object-defined error"]
["Range address $P$8 3",{"$f":"TAL_FLOC_CONST_D","v":{"$error":"#NAME?"}},null,"Proc SetValidations - Application-defined or object-defined error"]
["HV_LV Switches - LIST",42,16,"Proc Update_DVs - Object variable or With block variable not set"]
["Range address $P$42 3",{"$f":"TAL_RATING_VOLTS","v":{"$error":"#NAME?"}},null,"Proc SetValidations - Application-defined or object-defined error"]
["Range address $P$42 3",{"$f":"TAL_RATING_VOLTS","v":{"$error":"#NAME?"}},null,"Proc SetValidations - Application-defined or object-defined error"]
["Range address $P$42 3",{"$f":"TAL_RATING_VOLTS","v":{"$error":"#NAME?"}},null,"Proc SetValidations - Application-defined or object-defined error"]
["Range address $Q$4 6",null,null,"Proc SetValidations - Application-defined or object-defined error"]
["Range address $Q$4 6",null,null,"Proc SetValidations - Application-defined or object-defined error"]
["HV_LV Switches - LIST",8,17,"Proc Update_DVs - Object variable or With block variable not set"]
["Range address $Q$8 3",{"$f":"TAL_FLOC_CONST_D","v":{"$error":"#NAME?"}},null,"Proc SetValidations - Application-defined or object-defined error"]
["Range address $Q$8 3",{"$f":"TAL_FLOC_CONST_D","v":{"$error":"#NAME?"}},null,"Proc SetValidations - Application-defined or object-defined error"]
["Range address $Q$8 3",{"$f":"TAL_FLOC_CONST_D","v":{"$error":"#NAME?"}},null,"Proc SetValidations - Application-defined or object-defined error"]
["HV_LV Switches - LIST",42,17,"Proc Update_DVs - Object variable or With block variable not set"]
["Range address $Q$42 3",{"$f":"TAL_RATING_VOLTS","v":{"$error":"#NAME?"}},null,"Proc SetValidations - Application-defined or object-defined error"]
["Range address $Q$42 3",{"$f":"TAL_RATING_VOLTS","v":{"$error":"#NAME?"}},null,"Proc SetValidations - Application-defined or object-defined error"]
["Range address $Q$42 3",{"$f":"TAL_RATING_VOLTS","v":{"$error":"#NAME?"}},null,"Proc SetValidations - Application-defined or object-defined error"]
["Range address $R$4 6",null,null,"Proc SetValidations - Application-defined or object-defined error"]
["Range address $R$4 6",null,null,"Proc SetValidations - Application-defined or object-defined error"]
["HV_LV Switches - LIST",8,18,"Proc Update_DVs - Object variable or With block variable not set"]
["Range address $R$8 3",{"$f":"TAL_FLOC_CONST_D","v":{"$error":"#NAME?"}},null,"Proc SetValidations - Application-defined or object-defined error"]
["Range address $R$8 3",{"$f":"TAL_FLOC_CONST_D","v":{"$error":"#NAME?"}},null,"Proc SetValidations - Application-defined or object-defined error"]
["Range address $R$8 3",{"$f":"TAL_FLOC_CONST_D","v":{"$error":"#NAME?"}},null,"Proc SetValidations - Application-defined or object-defined error"]
["HV_LV Switches - LIST",42,18,"Proc Update_DVs - Object variable or With block variable not set"]
["Range address $R$42 3",{"$f":"TAL_RATING_VOLTS","v":{"$error":"#NAME?"}},null,"Proc SetValidations - Application-defined or object-defined error"]
["Range address $R$42 3",{"$f":"TAL_RATING_VOLTS","v":{"$error":"#NAME?"}},null,"Proc SetValidations - Application-defined or object-defined error"]
["Range address $R$42 3",{"$f":"TAL_RATING_VOLTS","v":{"$error":"#NAME?"}},null,"Proc SetValidations - Application-defined or object-defined error"]
["Range address $K$4 6",null,null,"Proc SetValidations - Application-defined or object-defined error"]
["Range address $K$4 6",null,null,"Proc SetValidations - Application-defined or object-defined error"]
["TRANSFORMER - LIST",8,11,"Proc Update_DVs - Object variable or With block variable not set"]
["Range address $K$8 3",{"$f":"TAL_FLOC_CONST_D","v":{"$error":"#NAME?"}},null,"Proc SetValidations - Application-defined or object-defined error"]
["Range address $K$8 3",{"$f":"TAL_FLOC_CONST_D","v":{"$error":"#NAME?"}},null,"Proc SetValidations - Application-defined or object-defined error"]
["Range address $K$8 3",{"$f":"TAL_FLOC_CONST_D","v":{"$error":"#NAME?"}},null,"Proc SetValidations - Application-defined or object-defined error"]
["TRANSFORMER - LIST",18,11,"Proc Update_DVs - Object variable or With block variable not set"]
["Range address $K$18 3",{"$f":"TAL_KVA_RATING","v":{"$error":"#NAME?"}},null,"Proc SetValidations - Application-defined or object-defined error"]
["Range address $K$18 3",{"$f":"TAL_KVA_RATING","v":{"$error":"#NAME?"}},null,"Proc SetValidations - Application-defined or object-defined error"]
["Range address $K$18 3",{"$f":"TAL_KVA_RATING","v":{"$error":"#NAME?"}},null,"Proc SetValidations - Application-defined or object-defined error"]
["TRANSFORMER - LIST",52,11,"Proc Update_DVs - Object variable or With block variable not set"]
["Range address $K$52 3",{"$f":"TAL_KVA_RATING","v":{"$error":"#NAME?"}},null,"Proc SetValidations - Application-defined or object-defined error"]
["Range address $K$52 3",{"$f":"TAL_KVA_RATING","v":{"$error":"#NAME?"}},null,"Proc SetValidations - Application-defined or object-defined error"]
["Range address $K$52 3",{"$f":"TAL_KVA_RATING","v":{"$error":"#NAME?"}},null,"Proc SetValidations - Application-defined or object-defined error"]
["TRANSFORMER - LIST",78,11,"Proc Update_DVs - Object variable or With block variable not set"]
["Range address $K$78 3",{"$f":"TAL_RATING_VOLTS","v":{"$error":"#NAME?"}},null,"Proc SetValidations - Application-defined or object-defined error"]
["Range address $K$78 3",{"$f":"TAL_RATING_VOLTS","v":{"$error":"#NAME?"}},null,"Proc SetValidations - Application-defined or object-defined error"]
["Range address $K$78 3",{"$f":"TAL_RATING_VOLTS","v":{"$error":"#NAME?"}},null,"Proc SetValidations - Application-defined or object-defined error"]

{"sheet":"Debug","index":2,"n_rows":49,"n_cols":6,"rows_kept":49,"cut":false,"hidden":true,"merged":[]}
["Sheet","Row","Column","Error"]
["2025-09-05T10:02:32","SAPTAL_Read","ASSM",0,11,"Unable to locate attribute POLEPLANT for FLOC ASSM00739414"]
["2025-09-05T10:02:33","SAPTAL_Read","ASSM",0,12,"Unable to locate attribute POLEPLANT for FLOC ASSM00739415"]
["2025-09-05T10:02:33","SAPTAL_Read","ASSM",0,13,"Unable to locate attribute POLEPLANT for FLOC ASSM00739416"]
["2025-09-05T10:02:34","SAPTAL_Read","ASSM",0,14,"Unable to locate attribute POLEPLANT for FLOC ASSM00739417"]
["2025-09-05T10:02:35","SAPTAL_Read","SWITCHGEAR",0,11,"Unable to locate attribute POLEPLANT for FLOC BBHV00020874"]
["2025-09-05T10:02:35","SAPTAL_Read","SWITCHGEAR",0,12,"Unable to locate attribute POLEPLANT for FLOC BBLV00038807"]
["2025-09-05T10:02:36","SAPTAL_Read","COLUMN",0,11,"Unable to locate attribute POLEPLANT for FLOC CLMN09557866"]
["2025-09-05T10:02:36","SAPTAL_Read","HV_LV Switches",0,11,"Unable to locate attribute POLEPLANT for FLOC DSSW00406722"]
["2025-09-05T10:02:37","SAPTAL_Read","HV_LV Switches",0,12,"Unable to locate attribute POLEPLANT for FLOC DSSW00406723"]
["2025-09-05T10:02:37","SAPTAL_Read","TRANSFORMER",0,11,"Unable to locate attribute POLEPLANT for FLOC DSTX10005756"]
["2025-09-05T10:02:38","SAPTAL_Read","DSUB (GRND)",0,11,"Unable to locate attribute POLEPLANT for FLOC DSUB00097041"]
["2025-09-05T10:02:38","SAPTAL_Read","DSUB (GRND)",0,12,"Unable to locate attribute POLEPLANT for FLOC DSUB00097042"]
["2025-09-05T10:02:39","SAPTAL_Read","SWITCHGEAR",0,13,"Unable to locate attribute POLEPLANT for FLOC HVDG00004016"]
["2025-09-05T10:02:39","SAPTAL_Read","SWITCHGEAR",0,14,"Unable to locate attribute POLEPLANT for FLOC LVDG00002916"]
["2025-09-05T10:02:39","SAPTAL_Read","PILLAR",0,11,"Unable to locate attribute POLEPLANT for FLOC PILL00411701"]
["2025-09-05T10:02:40","SAPTAL_Read","PILLAR",0,12,"Unable to locate attribute POLEPLANT for FLOC PILL00411702"]
["2025-09-05T10:02:40","SAPTAL_Read","POLE",0,11,"Unable to locate attribute POLEPLANT for FLOC POLE01004994"]
["2025-09-05T10:02:41","SAPTAL_Read","STREETLIGHT",0,11,"Unable to locate attribute POLEPLANT for FLOC SLGT00314229"]
["2025-09-05T10:02:41","SAPTAL_Read","HV_LV Switches",0,13,"Unable to locate attribute POLEPLANT for FLOC SWIT00245862"]
["2025-09-05T10:02:42","SAPTAL_Read","HV_LV Switches",0,14,"Unable to locate attribute POLEPLANT for FLOC SWIT00245863"]
["2025-09-05T10:02:42","SAPTAL_Read","HV_LV Switches",0,15,"Unable to locate attribute POLEPLANT for FLOC SWIT00245864"]
["2025-09-05T10:02:43","SAPTAL_Read","HV_LV Switches",0,16,"Unable to locate attribute POLEPLANT for FLOC SWIT00245865"]
["2025-09-05T10:02:43","SAPTAL_Read","HV_LV Switches",0,17,"Unable to locate attribute POLEPLANT for FLOC SWIT00245866"]
["2025-09-05T10:02:44","SAPTAL_Read","HV_LV Switches",0,18,"Unable to locate attribute POLEPLANT for FLOC SWIT00245867"]
["2025-09-10T13:44:54","SAPTAL_Read","ASSM",0,11,"Unable to locate attribute POLEPLANT for FLOC ASSM00739414"]
["2025-09-10T13:44:54","SAPTAL_Read","ASSM",0,12,"Unable to locate attribute POLEPLANT for FLOC ASSM00739415"]
["2025-09-10T13:44:55","SAPTAL_Read","ASSM",0,13,"Unable to locate attribute POLEPLANT for FLOC ASSM00739416"]
["2025-09-10T13:44:55","SAPTAL_Read","ASSM",0,14,"Unable to locate attribute POLEPLANT for FLOC ASSM00739417"]
["2025-09-10T13:44:55","SAPTAL_Read","SWITCHGEAR",0,11,"Unable to locate attribute POLEPLANT for FLOC BBHV00020874"]
["2025-09-10T13:44:56","SAPTAL_Read","SWITCHGEAR",0,12,"Unable to locate attribute POLEPLANT for FLOC BBLV00038807"]
["2025-09-10T13:44:56","SAPTAL_Read","COLUMN",0,11,"Unable to locate attribute POLEPLANT for FLOC CLMN09557866"]
["2025-09-10T13:44:56","SAPTAL_Read","HV_LV Switches",0,11,"Unable to locate attribute POLEPLANT for FLOC DSSW00406722"]
["2025-09-10T13:44:57","SAPTAL_Read","HV_LV Switches",0,12,"Unable to locate attribute POLEPLANT for FLOC DSSW00406723"]
["2025-09-10T13:44:57","SAPTAL_Read","TRANSFORMER",0,11,"Unable to locate attribute POLEPLANT for FLOC DSTX10005756"]
["2025-09-10T13:44:57","SAPTAL_Read","DSUB (GRND)",0,11,"Unable to locate attribute POLEPLANT for FLOC DSUB00097041"]
["2025-09-10T13:44:57","SAPTAL_Read","DSUB (GRND)",0,12,"Unable to locate attribute POLEPLANT for FLOC DSUB00097042"]
["2025-09-10T13:44:58","SAPTAL_Read","SWITCHGEAR",0,13,"Unable to locate attribute POLEPLANT for FLOC HVDG00004016"]
["2025-09-10T13:44:58","SAPTAL_Read","SWITCHGEAR",0,14,"Unable to locate attribute POLEPLANT for FLOC LVDG00002916"]
["2025-09-10T13:44:58","SAPTAL_Read","PILLAR",0,11,"Unable to locate attribute POLEPLANT for FLOC PILL00411701"]
["2025-09-10T13:44:59","SAPTAL_Read","PILLAR",0,12,"Unable to locate attribute POLEPLANT for FLOC PILL00411702"]
["2025-09-10T13:44:59","SAPTAL_Read","POLE",0,11,"Unable to locate attribute POLEPLANT for FLOC POLE01004994"]
["2025-09-10T13:44:59","SAPTAL_Read","STREETLIGHT",0,11,"Unable to locate attribute POLEPLANT for FLOC SLGT00314229"]
["2025-09-10T13:45:00","SAPTAL_Read","HV_LV Switches",0,13,"Unable to locate attribute POLEPLANT for FLOC SWIT00245862"]
["2025-09-10T13:45:00","SAPTAL_Read","HV_LV Switches",0,14,"Unable to locate attribute POLEPLANT for FLOC SWIT00245863"]
["2025-09-10T13:45:00","SAPTAL_Read","HV_LV Switches",0,15,"Unable to locate attribute POLEPLANT for FLOC SWIT00245864"]
["2025-09-10T13:45:01","SAPTAL_Read","HV_LV Switches",0,16,"Unable to locate attribute POLEPLANT for FLOC SWIT00245865"]
["2025-09-10T13:45:01","SAPTAL_Read","HV_LV Switches",0,17,"Unable to locate attribute POLEPLANT for FLOC SWIT00245866"]
["2025-09-10T13:45:01","SAPTAL_Read","HV_LV Switches",0,18,"Unable to locate attribute POLEPLANT for FLOC SWIT00245867"]

{"sheet":"SAPJOB","index":3,"n_rows":2,"n_cols":5,"rows_kept":2,"cut":false,"hidden":true,"merged":[]}
["PROJNUM","DRAWING","CAP APPLICATION NUMBER","SOURCEBY","SOURCEMAIL"]
[null,null,"VAS2708","26395"]

{"sheet":"SAPTAL","index":4,"n_rows":149,"n_cols":8,"rows_kept":149,"cut":false,"hidden":true,"merged":[]}
["PROJNUM","TABLABEL","FLOC","PROCMETHOD","TARGETOBJECT","SOURCEATTRIBUTE","SOURCEVALUE"]
[null,"ASSM","ASSM00739414","FLOC&EQ","FLOC","FLOC","ASSM00739414","ü"]
[null,"ASSM","ASSM00739414","FLOC&EQ","FLOC","REFLOC_D","ASSMPOLE0001","ü"]
[null,"ASSM","ASSM00739414","FLOC&EQ","FLOC","ABCKZ","O","ü"]
[null,"ASSM","ASSM00739414","FLOC&EQ","FLOC","POLEPLANT","100","û"]
[null,"ASSM","ASSM00739414","FLOC&EQ","FLOC","SUPFLOC","POLE01004994","ü"]
[null,"ASSM","ASSM00739414","FLOC&EQ","FLOC","MAINTLOC","1130","ü"]
[null,"ASSM","ASSM00739415","FLOC&EQ","FLOC","FLOC","ASSM00739415","ü"]
[null,"ASSM","ASSM00739415","FLOC&EQ","FLOC","REFLOC_D","ASSMCLMN0001","ü"]
[null,"ASSM","ASSM00739415","FLOC&EQ","FLOC","ABCKZ","O","ü"]
[null,"ASSM","ASSM00739415","FLOC&EQ","FLOC","POLEPLANT","100","û"]
[null,"ASSM","ASSM00739415","FLOC&EQ","FLOC","SUPFLOC","CLMN09557866","ü"]
[null,"ASSM","ASSM00739415","FLOC&EQ","FLOC","MAINTLOC","1130","ü"]
[null,"ASSM","ASSM00739416","FLOC&EQ","FLOC","FLOC","ASSM00739416","ü"]
[null,"ASSM","ASSM00739416","FLOC&EQ","FLOC","REFLOC_D","ASSMPILL0001","ü"]
[null,"ASSM","ASSM00739416","FLOC&EQ","FLOC","FLOC_TOT_D","GD_UGTERM","ü"]
[null,"ASSM","ASSM00739416","FLOC&EQ","FLOC","ABCKZ","O","ü"]
[null,"ASSM","ASSM00739416","FLOC&EQ","FLOC","POLEPLANT","100","û"]
[null,"ASSM","ASSM00739416","FLOC&EQ","FLOC","SUPFLOC","PILL00411701","ü"]
[null,"ASSM","ASSM00739416","FLOC&EQ","FLOC","MAINTLOC","1130","ü"]
[null,"ASSM","ASSM00739417","FLOC&EQ","FLOC","FLOC","ASSM00739417","ü"]
[null,"ASSM","ASSM00739417","FLOC&EQ","FLOC","REFLOC_D","ASSMPILL0001","ü"]
[null,"ASSM","ASSM00739417","FLOC&EQ","FLOC","FLOC_TOT_D","GD_UGTERM","ü"]
[null,"ASSM","ASSM00739417","FLOC&EQ","FLOC","ABCKZ","O","ü"]
[null,"ASSM","ASSM00739417","FLOC&EQ","FLOC","POLEPLANT","100","û"]
[null,"ASSM","ASSM00739417","FLOC&EQ","FLOC","SUPFLOC","PILL00411702","ü"]
[null,"ASSM","ASSM00739417","FLOC&EQ","FLOC","MAINTLOC","1130","ü"]
[null,"BBHV","BBHV00020874","FLOC&EQ","FLOC","FLOC","BBHV00020874","ü"]
[null,"BBHV","BBHV00020874","FLOC&EQ","FLOC","REFLOC_D","BBHVDSUB0001","ü"]
[null,"BBHV","BBHV00020874","FLOC&EQ","FLOC","ABCKZ","O","ü"]
[null,"BBHV","BBHV00020874","FLOC&EQ","FLOC","SUPFLOC","HVDG00004016","ü"]
[null,"BBHV","BBHV00020874","FLOC&EQ","FLOC","MAINTLOC","1130","ü"]
[null,"BBHV","BBHV00020874","FLOC&EQ","FLOC","POLEPLANT","100","û"]
[null,"BBLV","BBLV00038807","FLOC&EQ","FLOC","FLOC","BBLV00038807","ü"]
[null,"BBLV","BBLV00038807","FLOC&EQ","FLOC","REFLOC_D","BBLVDSUB0001","ü"]
[null,"BBLV","BBLV00038807","FLOC&EQ","FLOC","SUPFLOC","LVDG00002916","ü"]
[null,"BBLV","BBLV00038807","FLOC&EQ","FLOC","ABCKZ","O","ü"]
[null,"BBLV","BBLV00038807","FLOC&EQ","FLOC","POLEPLANT","100","û"]
[null,"BBLV","BBLV00038807","FLOC&EQ","FLOC","MAINTLOC","1130","ü"]
[null,"CLMN","CLMN09557866","FLOC&EQ","FLOC","FLOC","CLMN09557866","ü"]
[null,"CLMN","CLMN09557866","FLOC&EQ","FLOC","REFLOC_D","CLMNCLMN0001","ü"]
[null,"CLMN","CLMN09557866","FLOC&EQ","FLOC","ABCKZ","O","ü"]
[null,"CLMN","CLMN09557866","FLOC&EQ","FLOC","MAINTLOC","1130","ü"]
[null,"CLMN","CLMN09557866","FLOC&EQ","FLOC","POLEPLANT","100","û"]
[null,"CLMN","CLMN09557866","FLOC&EQ","FLOC","SORTFIELD","CL9557866","ü"]
[null,"DSSW","DSSW00406722","FLOC&EQ","FLOC","FLOC","DSSW00406722","ü"]
[null,"DSSW","DSSW00406722","FLOC&EQ","FLOC","REFLOC_D","DSSWDSUB0001","ü"]
[null,"DSSW","DSSW00406722","FLOC&EQ","FLOC","ABCKZ","O","ü"]
[null,"DSSW","DSSW00406722","FLOC&EQ","FLOC","MAINTLOC","1130","ü"]
[null,"DSSW","DSSW00406722","FLOC&EQ","FLOC","POLEPLANT","100","û"]
[null,"DSSW","DSSW00406722","FLOC&EQ","FLOC","SUPFLOC","HVDG00004016","ü"]
[null,"DSSW","DSSW00406723","FLOC&EQ","FLOC","FLOC","DSSW00406723","ü"]
[null,"DSSW","DSSW00406723","FLOC&EQ","FLOC","REFLOC_D","DSSWDSUB0002","ü"]
[null,"DSSW","DSSW00406723","FLOC&EQ","FLOC","ABCKZ","O","ü"]
[null,"DSSW","DSSW00406723","FLOC&EQ","FLOC","MAINTLOC","1130","ü"]
[null,"DSSW","DSSW00406723","FLOC&EQ","FLOC","POLEPLANT","100","û"]
[null,"DSSW","DSSW00406723","FLOC&EQ","FLOC","SUPFLOC","LVDG00002916","ü"]
[null,"DSTX","DSTX10005756","FLOC&EQ","FLOC","FLOC","DSTX10005756","ü"]
[null,"DSTX","DSTX10005756","FLOC&EQ","FLOC","REFLOC_D","DSTXDSUB0001","ü"]
[null,"DSTX","DSTX10005756","FLOC&EQ","FLOC","ABCKZ","O","ü"]
[null,"DSTX","DSTX10005756","FLOC&EQ","FLOC","SUPFLOC","DSUB00097042","ü"]
[null,"DSTX","DSTX10005756","FLOC&EQ","FLOC","POLEPLANT","100","û"]
[null,"DSTX","DSTX10005756","FLOC&EQ","FLOC","MAINTLOC","1130","ü"]
[null,"DSUB","DSUB00097041","FLOC&EQ","FLOC","FLOC","DSUB00097041","ü"]
[null,"DSUB","DSUB00097041","FLOC&EQ","FLOC","REFLOC_D","DSUBDSUB0001","ü"]
[null,"DSUB","DSUB00097041","FLOC&EQ","FLOC","MAINTLOC","1130","ü"]
[null,"DSUB","DSUB00097041","FLOC&EQ","FLOC","POLEPLANT","100","û"]
[null,"DSUB","DSUB00097041","FLOC&EQ","FLOC","SORTFIELD","DS97041","ü"]
[null,"DSUB","DSUB00097041","FLOC&EQ","FLOC","ABCKZ","O","ü"]
[null,"DSUB","DSUB00097042","FLOC&EQ","FLOC","FLOC","DSUB00097042","ü"]
[null,"DSUB","DSUB00097042","FLOC&EQ","FLOC","REFLOC_D","DSUBDSUB0001","ü"]
[null,"DSUB","DSUB00097042","FLOC&EQ","FLOC","MAINTLOC","1130","ü"]
[null,"DSUB","DSUB00097042","FLOC&EQ","FLOC","POLEPLANT","100","û"]
[null,"DSUB","DSUB00097042","FLOC&EQ","FLOC","SORTFIELD","DS97042","ü"]
[null,"DSUB","DSUB00097042","FLOC&EQ","FLOC","ABCKZ","O","ü"]
[null,"HVDG","HVDG00004016","FLOC&EQ","FLOC","FLOC","HVDG00004016","ü"]
[null,"HVDG","HVDG00004016","FLOC&EQ","FLOC","REFLOC_D","HVDGDSUB0001","ü"]
[null,"HVDG","HVDG00004016","FLOC&EQ","FLOC","ABCKZ","O","ü"]
[null,"HVDG","HVDG00004016","FLOC&EQ","FLOC","MAINTLOC","1130","ü"]
[null,"HVDG","HVDG00004016","FLOC&EQ","FLOC","POLEPLANT","100","û"]
[null,"LVDG","LVDG00002916","FLOC&EQ","FLOC","FLOC","LVDG00002916","ü"]
[null,"LVDG","LVDG00002916","FLOC&EQ","FLOC","REFLOC_D","LVDGDSUB0001","ü"]
[null,"LVDG","LVDG00002916","FLOC&EQ","FLOC","ABCKZ","O","ü"]
[null,"LVDG","LVDG00002916","FLOC&EQ","FLOC","POLEPLANT","100","û"]
[null,"LVDG","LVDG00002916","FLOC&EQ","FLOC","MAINTLOC","1130","ü"]
[null,"PILL","PILL00411701","FLOC&EQ","FLOC","FLOC","PILL00411701","ü"]
[null,"PILL","PILL00411701","FLOC&EQ","FLOC","REFLOC_D","PILLPILL0001","ü"]
[null,"PILL","PILL00411701","FLOC&EQ","FLOC","FLOC_TOT_D","ST_PILLST","ü"]
[null,"PILL","PILL00411701","FLOC&EQ","FLOC","MAINTLOC","1130","ü"]
[null,"PILL","PILL00411701","FLOC&EQ","FLOC","SORTFIELD","LV411701","ü"]
[null,"PILL","PILL00411701","FLOC&EQ","FLOC","ABCKZ","O","ü"]
[null,"PILL","PILL00411701","FLOC&EQ","FLOC","POLEPLANT","100","û"]
[null,"PILL","PILL00411702","FLOC&EQ","FLOC","FLOC","PILL00411702","ü"]
[null,"PILL","PILL00411702","FLOC&EQ","FLOC","REFLOC_D","PILLPILL0001","ü"]
[null,"PILL","PILL00411702","FLOC&EQ","FLOC","FLOC_TOT_D","ST_PILLST","ü"]
[null,"PILL","PILL00411702","FLOC&EQ","FLOC","MAINTLOC","1130","ü"]
[null,"PILL","PILL00411702","FLOC&EQ","FLOC","SORTFIELD","LV411702","ü"]
[null,"PILL","PILL00411702","FLOC&EQ","FLOC","ABCKZ","O","ü"]
[null,"PILL","PILL00411702","FLOC&EQ","FLOC","POLEPLANT","100","û"]
[null,"POLE","POLE01004994","FLOC&EQ","FLOC","FLOC","POLE01004994","ü"]
[null,"POLE","POLE01004994","FLOC&EQ","FLOC","REFLOC_D","POLEPOLE0001","ü"]
[null,"POLE","POLE01004994","FLOC&EQ","FLOC","FLOC_TOT_D","ST_POLEST","ü"]
[null,"POLE","POLE01004994","FLOC&EQ","FLOC","MAINTLOC","1130","ü"]
[null,"POLE","POLE01004994","FLOC&EQ","FLOC","POLEPLANT","100","û"]
[null,"POLE","POLE01004994","FLOC&EQ","FLOC","SORTFIELD","PL1004994","ü"]
[null,"POLE","POLE01004994","FLOC&EQ","FLOC","ABCKZ","O","ü"]
[null,"SLGT","SLGT00314229","FLOC&EQ","FLOC","FLOC","SLGT00314229","ü"]
[null,"SLGT","SLGT00314229","FLOC&EQ","FLOC","REFLOC_D","SLGTCLMN0001","ü"]
[null,"SLGT","SLGT00314229","FLOC&EQ","FLOC","SORTFIELD","SL314229","ü"]
[null,"SLGT","SLGT00314229","FLOC&EQ","FLOC","POLEPLANT","100","û"]
[null,"SLGT","SLGT00314229","FLOC&EQ","FLOC","ABCKZ","O","ü"]
[null,"SLGT","SLGT00314229","FLOC&EQ","FLOC","SUPFLOC","CLMN09557866","ü"]
[null,"SLGT","SLGT00314229","FLOC&EQ","FLOC","MAINTLOC","1130","ü"]
[null,"SWIT","SWIT00245862","FLOC&EQ","FLOC","FLOC","SWIT00245862","ü"]
[null,"SWIT","SWIT00245862","FLOC&EQ","FLOC","REFLOC_D","SWITDSUB0001","ü"]
[null,"SWIT","SWIT00245862","FLOC&EQ","FLOC","POLEPLANT","100","û"]
[null,"SWIT","SWIT00245862","FLOC&EQ","FLOC","ABCKZ","O","ü"]
[null,"SWIT","SWIT00245862","FLOC&EQ","FLOC","MAINTLOC","1130","ü"]
[null,"SWIT","SWIT00245862","FLOC&EQ","FLOC","SUPFLOC","HVDG00004016","ü"]
[null,"SWIT","SWIT00245863","FLOC&EQ","FLOC","FLOC","SWIT00245863","ü"]
[null,"SWIT","SWIT00245863","FLOC&EQ","FLOC","REFLOC_D","SWITDSUB0001","ü"]
[null,"SWIT","SWIT00245863","FLOC&EQ","FLOC","POLEPLANT","100","û"]
[null,"SWIT","SWIT00245863","FLOC&EQ","FLOC","ABCKZ","O","ü"]
[null,"SWIT","SWIT00245863","FLOC&EQ","FLOC","MAINTLOC","1130","ü"]
[null,"SWIT","SWIT00245863","FLOC&EQ","FLOC","SUPFLOC","HVDG00004016","ü"]
[null,"SWIT","SWIT00245864","FLOC&EQ","FLOC","FLOC","SWIT00245864","ü"]
[null,"SWIT","SWIT00245864","FLOC&EQ","FLOC","REFLOC_D","SWITDSUB0002","ü"]
[null,"SWIT","SWIT00245864","FLOC&EQ","FLOC","POLEPLANT","100","û"]
[null,"SWIT","SWIT00245864","FLOC&EQ","FLOC","ABCKZ","O","ü"]
[null,"SWIT","SWIT00245864","FLOC&EQ","FLOC","MAINTLOC","1130","ü"]
[null,"SWIT","SWIT00245864","FLOC&EQ","FLOC","SUPFLOC","LVDG00002916","ü"]
[null,"SWIT","SWIT00245865","FLOC&EQ","FLOC","FLOC","SWIT00245865","ü"]
[null,"SWIT","SWIT00245865","FLOC&EQ","FLOC","REFLOC_D","SWITDSUB0002","ü"]
[null,"SWIT","SWIT00245865","FLOC&EQ","FLOC","POLEPLANT","100","û"]
[null,"SWIT","SWIT00245865","FLOC&EQ","FLOC","ABCKZ","O","ü"]
[null,"SWIT","SWIT00245865","FLOC&EQ","FLOC","MAINTLOC","1130","ü"]
[null,"SWIT","SWIT00245865","FLOC&EQ","FLOC","SUPFLOC","LVDG00002916","ü"]
[null,"SWIT","SWIT00245866","FLOC&EQ","FLOC","FLOC","SWIT00245866","ü"]
[null,"SWIT","SWIT00245866","FLOC&EQ","FLOC","REFLOC_D","SWITDSUB0002","ü"]
[null,"SWIT","SWIT00245866","FLOC&EQ","FLOC","POLEPLANT","100","û"]
[null,"SWIT","SWIT00245866","FLOC&EQ","FLOC","ABCKZ","O","ü"]
[null,"SWIT","SWIT00245866","FLOC&EQ","FLOC","MAINTLOC","1130","ü"]
[null,"SWIT","SWIT00245866","FLOC&EQ","FLOC","SUPFLOC","LVDG00002916","ü"]
[null,"SWIT","SWIT00245867","FLOC&EQ","FLOC","FLOC","SWIT00245867","ü"]
[null,"SWIT","SWIT00245867","FLOC&EQ","FLOC","REFLOC_D","SWITDSUB0002","ü"]
[null,"SWIT","SWIT00245867","FLOC&EQ","FLOC","POLEPLANT","100","û"]
[null,"SWIT","SWIT00245867","FLOC&EQ","FLOC","ABCKZ","O","ü"]
[null,"SWIT","SWIT00245867","FLOC&EQ","FLOC","MAINTLOC","1130","ü"]
[null,"SWIT","SWIT00245867","FLOC&EQ","FLOC","SUPFLOC","LVDG00002916","ü"]

{"sheet":"SAPRANGES","index":5,"n_rows":3597,"n_cols":4,"rows_kept":3597,"cut":false,"hidden":true,"merged":[]}
["Range","Role","Value","Code"]
["AM_BALL_COLOUR","Header","Description","Code"]
["AM_BALL_COLOUR","Value","Orange Marker Ball","ORANGE"]
["AM_BALL_COLOUR","Value","Red Marker Ball","RED"]
["AM_BALL_COLOUR","Value","White Marker Ball","WHITE"]
["AM_BALL_COLOUR","Value","Yellow Marker Ball","YELLOW"]
["AM_BALL_PURPOSE","Header","Description","Code"]
["AM_BALL_PURPOSE","Value","Aircraft Marker Ball","AIRCRAFT"]
["AM_BALL_PURPOSE","Value","Boat Marker Ball","BOAT"]
["AM_BALL_PURPOSE","Value","Helicopter Marker Ball","HELICOPTER"]
["AM_BALL_PURPOSE","Value","Vehicle Marker","VEHICLE"]
["ANTENNA_3G","Header","Description","Code"]
["ANTENNA_3G","Value","No","NO"]
["ANTENNA_3G","Value","Yes","YES"]
["ARC_QUENCHING_MEDIUM","Header","Description","Code"]
["ARC_QUENCHING_MEDIUM","Value","Air","AIR"]
["ARC_QUENCHING_MEDIUM","Value","Oil","OIL"]
["ARC_QUENCHING_MEDIUM","Value","Sf6","SF6"]
["ARC_QUENCHING_MEDIUM","Value","Unknown","UNKNOWN"]
["ARC_QUENCHING_MEDIUM","Value","Vacuum","VACUUM"]
["BASEMENT_VENT_TYPE","Header","Description","Code"]
["BASEMENT_VENT_TYPE","Value","Forced","FORCED"]
["BASEMENT_VENT_TYPE","Value","Natural","NATURAL"]
["BASEMENT_VENT_TYPE","Value","Unknown","UNKNOWN"]
["BILLING_CUSTOMER","Header","Description","Code"]
["BILLING_CUSTOMER","Value","ANTEGRA (Unmetered Lighting)","ANTEGRA_UNMETERED"]
["BILLING_CUSTOMER","Value","Australian Co-Operative","AUST_CO_OP"]
["BILLING_CUSTOMER","Value","Bankstown City Council","BANKSTOWN"]
["BILLING_CUSTOMER","Value","Bathurst Regional Council","BATHURST"]
["BILLING_CUSTOMER","Value","Blacktown City Council","BLACKTOWN"]
["BILLING_CUSTOMER","Value","Blue Mountains City Council","BLUE_MOUNTAINS"]
["BILLING_CUSTOMER","Value","Business Land Group","BUSINESS_LAND_GRP"]
["BILLING_CUSTOMER","Value","Camden Municipal Council","CAMDEN"]
["BILLING_CUSTOMER","Value","Campbelltown City Council","CAMPBELLTOWN"]
["BILLING_CUSTOMER","Value","Campelltown Rugby League","CAMPBELLTOWN_RUGBY_LEAG"]
["BILLING_CUSTOMER","Value","Canterbury Bankstown Council","CANTERBURY_BANKSTOWN"]
["BILLING_CUSTOMER","Value","SRA (C/Vale C/Ford B/Town)","CITY_RAIL_CVALE_CFORD_CTOWN"]
["BILLING_CUSTOMER","Value","CityRail (Illawarra)","CITY_RAIL_ILLAWARRA"]
["BILLING_CUSTOMER","Value","Cityrail (South)","CITY_RAIL_SOUTH"]
["BILLING_CUSTOMER","Value","Community Management Committee","COMM_MANAG_COMM"]
["BILLING_CUSTOMER","Value","Cumberland City Council","CUMBERLAND"]
["BILLING_CUSTOMER","Value","Integral Energy - P&GS","ENDEAVOUR_ENERGY_PGS"]
["BILLING_CUSTOMER","Value","Fairfield City Council","FAIRFIELD"]
["BILLING_CUSTOMER","Value","Federal Airports Corp","FED_AIRPORT_CORP"]
["BILLING_CUSTOMER","Value","Glenfield Special School","GLENFIELD_SPEC_SCHOOL"]
["BILLING_CUSTOMER","Value","Hawkesbury City Council","HAWKESBURY"]
["BILLING_CUSTOMER","Value","The Hills Shire Council","HILLS_SHIRE"]
["BILLING_CUSTOMER","Value","Hmas Albatross","HMAS_ALBATROSS"]
["BILLING_CUSTOMER","Value","Holroyd Municipality","HOLROYD"]
["BILLING_CUSTOMER","Value","Hornsby Shire Council","HORNSBY"]
["BILLING_CUSTOMER","Value","Hurlstone Agric HSchool","HURLSTONE_AG_SCHOOL"]
["BILLING_CUSTOMER","Value","Kiama Municipal Council","KIAMA"]
["BILLING_CUSTOMER","Value","Lithgow City Council","LITHGOW"]
["BILLING_CUSTOMER","Value","Liverpool City Council","LIVERPOOL"]
["BILLING_CUSTOMER","Value","Marsden Park Developments","MARSDEN_PARK_DEV"]
["BILLING_CUSTOMER","Value","Mid Western Regional Council","MID_WESTERN"]
["BILLING_CUSTOMER","Value","NSW Maritime Authority","NSW_MARITIME_AUTH"]
["BILLING_CUSTOMER","Value","Oberon Council","OBERON"]
["BILLING_CUSTOMER","Value","Parramatta City Council","PARRAMATTA"]
["BILLING_CUSTOMER","Value","Penrith City Council","PENRITH"]
["BILLING_CUSTOMER","Value","Port Kembla Operations P/l","PORT_KEMBLA_OPS_PL"]
["BILLING_CUSTOMER","Value","Land & Water Cons-pwd Sth Cst)","PWD_SOUTH_COAST"]
["BILLING_CUSTOMER","Value","Roads & Traffic Auth(Corrimal)","RTA_CORRIMAL"]
["BILLING_CUSTOMER","Value","Rta (national Hwy) Guildford","RTA_GUILDFORD_NAT_HWAY"]
["BILLING_CUSTOMER","Value","RTA (state Roads) Guildford","RTA_GUILDFORD_STATE_RD"]
["BILLING_CUSTOMER","Value","RTA (Illawarra Flash Symbols)","RTA_ILLAW_FLASH_SYMBOL"]
["BILLING_CUSTOMER","Value","RTA M7","RTA_M7"]
["BILLING_CUSTOMER","Value","RTA (North)","RTA_NORTH"]
["BILLING_CUSTOMER","Value","RTA North West Transitway","RTA_NORTH_WEST_TRANSITWAY"]
["BILLING_CUSTOMER","Value","Roads & Traffic Auth (Parkes)","RTA_PARKES"]
["BILLING_CUSTOMER","Value","RTA (Parramatta Flash Symbol)","RTA_PARRA_FLASH_SYMBOL"]
["BILLING_CUSTOMER","Value","RTA (Unmetered Lighting)","RTA_UNMETERED"]
["BILLING_CUSTOMER","Value","Ryde Municipal Council","RYDE"]
["BILLING_CUSTOMER","Value","Rylstone Shire","RYLSTONE"]
["BILLING_CUSTOMER","Value","Shellharbour Municipal Council","SHELLHARBOUR"]
["BILLING_CUSTOMER","Value","Shoalhaven City Council","SHOALHAVEN"]
["BILLING_CUSTOMER","Value","Statewide Roads","STATE_WIDE_ROADS"]
["BILLING_CUSTOMER","Value","Strata Plan 70002","STRATA_PLAN_70002"]
["BILLING_CUSTOMER","Value","Telstra (Nepean Div)","TELSTRA_NEPEAN"]
["BILLING_CUSTOMER","Value","Telstra (Parramatta Div)","TELSTRA_PARRA"]
["BILLING_CUSTOMER","Value","Transport Department NSW","TRANSPORT_DEPT_NSW"]
["BILLING_CUSTOMER","Value","Sydney Catchmt Auth (warr Dam)","WARRAGAMBA_DAM"]
["BILLING_CUSTOMER","Value","Wingecarribee Shire Council","WINGCARRIBEE"]
["BILLING_CUSTOMER","Value","Wollondilly Shire Council","WOLLONDILLY"]
["BILLING_CUSTOMER","Value","Wollongong City Council","WOLLONGONG"]
["BLADDER","Header","Description","Code"]
["BLADDER","Value","No","NO"]
["BLADDER","Value","Yes","YES"]
["BREATHER_TYPE","Header","Description","Code"]
["BREATHER_TYPE","Value","Electrostatic Dryer","ELECTROSTATIC_DRYER"]
["BREATHER_TYPE","Value","Free","FREE"]
["BREATHER_TYPE","Value","Mechanical Dryer","MECHANICAL_DRYER"]
["BREATHER_TYPE","Value","Refrigerated Breather","REFRIGERATED"]
["BREATHER_TYPE","Value","Sealed","SEALED"]
["BREATHER_TYPE","Value","Semi Sealed","SEMI_SEALED"]
["BREATHER_TYPE","Value","Silica Gel","SILICA_GEL"]
["BREATHER_TYPE","Value","Unknown","UNKNOWN"]
["BUILDING_TYPE","Header","Description","Code"]
["BUILDING_TYPE","Value","Permanent","PERMANENT"]
["BUILDING_TYPE","Value","Permanent - Brick","PERMANENT_BRICK"]
["BUILDING_TYPE","Value","Permanent-Cladding","PERMANENT_CLADDING"]
["BUILDING_TYPE","Value","Portable","PORTABLE"]
["BUILDING_TYPE","Value","Portable&Permanent","PORTABLE&PERMANENT"]
["BUILDING_TYPE","Value","Unknown","UNKNOWN"]
["BUSHFIRE_ZONE","Header","Description","Code"]
["BUSHFIRE_ZONE","Value","No Bushfire Risk","0"]
["BUSHFIRE_ZONE","Value","Negligible Bushfire Risk","1"]
["BUSHFIRE_ZONE","Value","Low Bushfire Risk","2"]
["BUSHFIRE_ZONE","Value","Medium Bushfire Risk","3"]
["BUSHFIRE_ZONE","Value","High Bushfire Risk","4"]
["CLASS_CT","Header","Description","Code"]
["CLASS_CT","Value","0","0"]
["CLASS_CT","Value","1","1"]
["CLASS_CT","Value","2","2"]
["CLASS_CT","Value","5","5"]
["CLASS_CT","Value","C","C"]
["CLASS_CT","Value","D","D"]
["CLASS_CT","Value","E","E"]
["CLASS_CT","Value","I","I"]
["CLASS_CT","Value","Unknown","UNKNOWN"]
["CLASS_CT","Value","Z","Z"]
["COASTAL_ZONE","Header","Description","Code"]
["COASTAL_ZONE","Value","No","NO"]
["COASTAL_ZONE","Value","Yes","YES"]
["COLUMN_FUNCTION","Header","Description","Code"]
["COLUMN_FUNCTION","Value","Distribution","DISTRIBUTION"]
["COLUMN_FUNCTION","Value","Extended Service","EXTENDED_SERVICE"]
["COLUMN_FUNCTION","Value","Streetlighting","STREETLIGHTING"]
["COLUMN_FUNCTION","Value","Unknown","UNKNOWN"]
["COL_SUPP_TYPE","Header","Description","Code"]
["COL_SUPP_TYPE","Value","Direct Buried","DIRECT_BURIED"]
["COL_SUPP_TYPE","Value","Ragbolt","RAGBOLT"]
["CONDUCTOR_CODE","Header","Description","Code"]
["CONDUCTOR_CODE","Value","3/2.00 Sc/Gz - 11Kv 3Ph","A1"]
["CONDUCTOR_CODE","Value","3/4/2.50 Acsr/Gz - 11Kv 3Ph","A10"]
["CONDUCTOR_CODE","Value","6/1/2.50 Sc/Gz Gldy - 11Kv 3Ph","A12"]
["CONDUCTOR_CODE","Value","7/1.75 Hdcu - 11Kv 3Ph","A14"]
["CONDUCTOR_CODE","Value","7/2.25 Aac - 11Kv 3Ph","A16"]
["CONDUCTOR_CODE","Value","6/1/2.50 Acsr/Gz - 11Kv 3Ph","A18"]
["CONDUCTOR_CODE","Value","3/0.080 Sc/Gz - 11Kv 3Ph","A2"]
["CONDUCTOR_CODE","Value","4/3/3.00 Acsr/Gz - 11Kv 3Ph","A20"]
["CONDUCTOR_CODE","Value","4/3/3.75 Acsr/Gz Hs - 11Kv 3Ph","A21"]
["CONDUCTOR_CODE","Value","3/4/3.37 Acsr/Gz - 11Kv 3Ph","A22"]
["CONDUCTOR_CODE","Value","7/2.00 Hdcu 7/0.080 - 11Kv 3Ph","A24"]
["CONDUCTOR_CODE","Value","7/3.00 Aaac - 11Kv 3Ph","A25"]
["CONDUCTOR_CODE","Value","6/1/3.00 Acsr/Gz - 11Kv 3Ph","A26"]
["CONDUCTOR_CODE","Value","7/2.50 Aaac - 11Kv 3Ph","A27"]
["CONDUCTOR_CODE","Value","7/3.00 Aac - 11Kv 3Ph","A28"]
["CONDUCTOR_CODE","Value","50Mm² 3C Hvabc Nms - 11Kv 3Ph","A29"]
["CONDUCTOR_CODE","Value","7/0.064 Sc/Gz - 11Kv 3Ph","A3"]
["CONDUCTOR_CODE","Value","7/.104-19/.064 Hdcu - 11Kv 3Ph","A30"]
["CONDUCTOR_CODE","Value","7/0.104 Sc/Gz - 11Kv 3Ph","A31"]
["CONDUCTOR_CODE","Value","7/3.75 Aac - 11Kv 3Ph","A32"]
["CONDUCTOR_CODE","Value","80Mm² Cct - 11Kv 3Ph","A33"]
["CONDUCTOR_CODE","Value","6/1/3.75 Acsr/Gz - 11Kv 3Ph","A34"]
["CONDUCTOR_CODE","Value","7/3.75 Aaac - 11Kv 3Ph","A35"]
["CONDUCTOR_CODE","Value","0.06In² Cu Equiv - 11Kv 3Ph","A38"]
["CONDUCTOR_CODE","Value","95Mm² 3C Hvabc Ms - 11Kv 3Ph","A39"]
["CONDUCTOR_CODE","Value","3/2.75 Sc/Gz - 11Kv 3Ph","A4"]
["CONDUCTOR_CODE","Value","19/2.00 Hdcu - 11Kv 3Ph","A40"]
["CONDUCTOR_CODE","Value","120Mm² Cct - 11Kv 3Ph","A41"]
["CONDUCTOR_CODE","Value","6/4.75+7/1.60 Acsr - 11Kv 3Ph","A42"]
["CONDUCTOR_CODE","Value","7/4.50 Aaac - 11Kv 3Ph","A43"]
["CONDUCTOR_CODE","Value","7/4.50 Aac - 11Kv 3Ph","A44"]
["CONDUCTOR_CODE","Value","7/4.75 Aac - 11Kv 3Ph","A45"]
["CONDUCTOR_CODE","Value","37/0.064 Hdcu - 11Kv 3Ph","A46"]
["CONDUCTOR_CODE","Value","30/7/2.50 Acsr/Gz - 11Kv 3Ph","A48"]
["CONDUCTOR_CODE","Value","0.1In² Cu Equiv - 11Kv 3Ph","A49"]
["CONDUCTOR_CODE","Value","7/0.80 Sc/Gz - 11Kv 3Ph","A5"]
["CONDUCTOR_CODE","Value","19/0.101 Hdcu - 11Kv 3Ph","A50"]
["CONDUCTOR_CODE","Value","180Mm² Cct - 11Kv 3Ph","A51"]
["CONDUCTOR_CODE","Value","30/7/0.102 Acsr/Gz - 11Kv 3Ph","A52"]
["CONDUCTOR_CODE","Value","19/3.25 Aac - 11Kv 3Ph","A54"]
["CONDUCTOR_CODE","Value","19/3.25 Aaac - 11Kv 3Ph","A55"]
["CONDUCTOR_CODE","Value","26/2.54+7/1.90 Acsr - 11Kv 3Ph","A58"]
["CONDUCTOR_CODE","Value","150Mm² 3C Hvabc Nms-11Kv 3Ph","A59"]
["CONDUCTOR_CODE","Value","3/4/1.75 Acsr/Gz Hs - 11Kv 3Ph","A6"]
["CONDUCTOR_CODE","Value","19/.116-37/.083 Hdcu-11Kv 3Ph","A60"]
["CONDUCTOR_CODE","Value","30/7/3.00 Acsr/Gz - 11Kv 3Ph","A62"]
["CONDUCTOR_CODE","Value","19/3.75 Aac - 11Kv 3Ph","A64"]
["CONDUCTOR_CODE","Value","19/3.75 Aaac - 11Kv 3Ph","A65"]
["CONDUCTOR_CODE","Value","2 X 7/4.50 Aac - 11Kv 3Ph","A66"]
["CONDUCTOR_CODE","Value","3/4/0.0661 Acsr/Gz - 11Kv 3Ph","A7"]
["CONDUCTOR_CODE","Value","19/4.75 Aaac - 11Kv 3Ph","A71"]
["CONDUCTOR_CODE","Value","19/4.75 Aac - 11Kv 3Ph","A72"]
["CONDUCTOR_CODE","Value","2 X 19/3.25 Aac - 11Kv 3Ph","A74"]
["CONDUCTOR_CODE","Value","2 X 19/3.75 Aac - 11Kv 3Ph","A80"]
["CONDUCTOR_CODE","Value","61/3.25 Aac - 11Kv 3Ph","A86"]
["CONDUCTOR_CODE","Value","Unknown Oh - 11Kv 3Ph","A99"]
["CONDUCTOR_CODE","Value","3/4/2.50 Acsr/Gz - 11Kv 2Ph","B10"]
["CONDUCTOR_CODE","Value","6/1/2.50 Sc/Gz Gldy - 11Kv 2Ph","B12"]
["CONDUCTOR_CODE","Value","7/1.75 Hdcu - 11Kv 2Ph","B14"]
["CONDUCTOR_CODE","Value","6/1/2.50 Acsr/Gz - 11Kv 2Ph","B18"]
["CONDUCTOR_CODE","Value","3/0.080 Sc/Gz - 11Kv 2Ph","B2"]
["CONDUCTOR_CODE","Value","4/3/3.00 Acsr/Gz - 11Kv 2Ph","B20"]
["CONDUCTOR_CODE","Value","3/4/3.37 Acsr/Gz - 11Kv 2Ph","B22"]
["CONDUCTOR_CODE","Value","7/2.00 Hdcu 7/0.080 - 11Kv 2Ph","B24"]
["CONDUCTOR_CODE","Value","7/3.00 Aaac - 11Kv 2Ph","B25"]
["CONDUCTOR_CODE","Value","6/1/3.00 Acsr/Gz - 11Kv 2Ph","B26"]
["CONDUCTOR_CODE","Value","7/2.50 Aaac - 11Kv 2Ph","B27"]
["CONDUCTOR_CODE","Value","7/3.00 Aac - 11Kv 2Ph","B28"]
["CONDUCTOR_CODE","Value","50mm2 Al 3C HVABC NMS 11kV","B29"]
["CONDUCTOR_CODE","Value","7/0.064 Sc/Gz - 11Kv 2Ph","B3"]
["CONDUCTOR_CODE","Value","7/3.75 Aac - 11Kv 2Ph","B32"]
["CONDUCTOR_CODE","Value","80Mm² Cct - 11Kv 2Ph","B33"]
["CONDUCTOR_CODE","Value","6/1/3.75 Acsr/Gz - 11Kv 2Ph","B34"]
["CONDUCTOR_CODE","Value","7/3.75 Aaac - 11Kv 2Ph","B35"]
["CONDUCTOR_CODE","Value","3/2.75 Sc/Gz - 11Kv 2Ph","B4"]
["CONDUCTOR_CODE","Value","19/2.00 Hdcu - 11Kv 2Ph","B40"]
["CONDUCTOR_CODE","Value","120Mm² Cct - 11Kv 2Ph","B41"]
["CONDUCTOR_CODE","Value","6/4.75+7/1.60 Acsr - 11Kv 2Ph","B42"]
["CONDUCTOR_CODE","Value","7/4.50 Aaac - 11Kv 2Ph","B43"]
["CONDUCTOR_CODE","Value","7/4.50 Aac - 11Kv 2Ph","B44"]
["CONDUCTOR_CODE","Value","7/0.80 Sc/Gz - 11Kv 2Ph","B5"]
["CONDUCTOR_CODE","Value","180Mm² Cct - 11Kv 2Ph","B51"]
["CONDUCTOR_CODE","Value","19/3.25 Aac - 11Kv 2Ph","B54"]
["CONDUCTOR_CODE","Value","3/4/1.75 Acsr/Gz Hs - 11Kv 2Ph","B6"]
["CONDUCTOR_CODE","Value","19/3.75 Aac - 11Kv 2Ph","B64"]
["CONDUCTOR_CODE","Value","3/4/0.0661 Acsr/Gz - 11Kv 2Ph","B7"]
["CONDUCTOR_CODE","Value","Unknown Oh - 11Kv 2Ph","B99"]
["CONDUCTOR_CODE","Value","3/4/2.50 Acsr/Gz - 415V 1Ph","C10"]
["CONDUCTOR_CODE","Value","7/2.25 Aac - 415V 1Ph","C11"]
["CONDUCTOR_CODE","Value","6/1/2.50 Sc/Gz Gldy - 415V 1Ph","C12"]
["CONDUCTOR_CODE","Value","16Mm² Cu Twin Di Pvc-415V 1Ph","C13"]
["CONDUCTOR_CODE","Value","7/1.75 Hdcu - 415V 1Ph","C14"]
["CONDUCTOR_CODE","Value","7/2.25 Aac - 415V1Ph","C16"]
["CONDUCTOR_CODE","Value","25Mm² Al Xlpe - 415V 1Ph","C17"]
["CONDUCTOR_CODE","Value","6/1/2.50 Acsr/Gz - 415V 1Ph","C18"]
["CONDUCTOR_CODE","Value","0.035In² Cu Equiv - 415V 1Ph","C19"]
["CONDUCTOR_CODE","Value","3/0.080 Sc/Gz - 415V 1Ph","C2"]
["CONDUCTOR_CODE","Value","4/3/3.00 Acsr/Gz - 415V 1Ph","C20"]
["CONDUCTOR_CODE","Value","4/3/3.75 Acsr/Gz Hs - 415V 1Ph","C21"]
["CONDUCTOR_CODE","Value","25Mm² 1C Lvabc - 415V 1Ph","C23"]
["CONDUCTOR_CODE","Value","7/2.00 Hdcu 7/0.080 - 415V 1Ph","C24"]
["CONDUCTOR_CODE","Value","7/3.00 Aaac - 415V 1Ph","C25"]
["CONDUCTOR_CODE","Value","6/1/3.00 Acsr/Gz - 415V 1Ph","C26"]
["CONDUCTOR_CODE","Value","7/2.50 Aaac - 415V 1Ph","C27"]
["CONDUCTOR_CODE","Value","7/3.00 Aac - 415V 1Ph","C28"]
["CONDUCTOR_CODE","Value","7/0.064 Sc/Gz - 415V 1Ph","C3"]
["CONDUCTOR_CODE","Value","7/.104-19/.064 Hdcu - 415V 1Ph","C30"]
["CONDUCTOR_CODE","Value","7/3.75 Aac - 415V 1Ph","C32"]
["CONDUCTOR_CODE","Value","6/1/3.75 Acsr/Gz - 415V 1Ph","C34"]
["CONDUCTOR_CODE","Value","7/3.75 Aaac - 415V 1Ph","C35"]
["CONDUCTOR_CODE","Value","19/2.14 Hdcu Pvc - 415V 1Ph","C36"]
["CONDUCTOR_CODE","Value","0.06In² Cu Equiv - 415V 1Ph","C38"]
["CONDUCTOR_CODE","Value","19/2.00 Hdcu - 415V 1Ph","C40"]
["CONDUCTOR_CODE","Value","6/4.75+7/1.60 Acsr - 415V 1Ph","C42"]
["CONDUCTOR_CODE","Value","7/4.50 Aaac - 415V 1Ph","C43"]
["CONDUCTOR_CODE","Value","7/4.50 Aac - 415V 1Ph","C44"]
["CONDUCTOR_CODE","Value","7/4.75 Aac - 415V 1Ph","C45"]
["CONDUCTOR_CODE","Value","37/0.064 Hdcu - 415V 1Ph","C46"]
["CONDUCTOR_CODE","Value","95Mm²  4C Lvabc - 415V 1Ph","C47"]
["CONDUCTOR_CODE","Value","0.1In² Cu Equiv - 415V 1Ph","C49"]
["CONDUCTOR_CODE","Value","7/0.80 Sc/Gz - 415V 1Ph","C5"]
["CONDUCTOR_CODE","Value","19/3.25 Aac - 415V 1Ph","C54"]
["CONDUCTOR_CODE","Value","150Mm²4C+16Mm²1C Lvabc-415V1Ph","C56"]
["CONDUCTOR_CODE","Value","95Mm²4C+16Mm²1C Lvabc-415V 1Ph","C57"]
["CONDUCTOR_CODE","Value","3/4/1.75 Acsr/Gz Hs - 415V 1Ph","C6"]
["CONDUCTOR_CODE","Value","19/3.75 Aac - 415V 1Ph","C64"]
["CONDUCTOR_CODE","Value","19/3.75 Aaac - 415V 1Ph","C65"]
["CONDUCTOR_CODE","Value","16Mm² Cu Pvc - 415V 1Ph","C8"]
["CONDUCTOR_CODE","Value","95Mm²  1C Lvabc - 415V 1Ph","C81"]
["CONDUCTOR_CODE","Value","Unknown Oh - 415V 1Ph","C99"]
["CONDUCTOR_CODE","Value","3/4/2.50 Acsr/Gz - 415V 2Ph","D10"]
["CONDUCTOR_CODE","Value","6/1/2.50 Sc/Gz Gldy - 415V 2Ph","D12"]
["CONDUCTOR_CODE","Value","7/1.75 Hdcu - 415V 2Ph","D14"]
["CONDUCTOR_CODE","Value","7/2.25 Aac - 415V 2Ph","D16"]
["CONDUCTOR_CODE","Value","6/1/2.50 Acsr/Gz - 415V 2Ph","D18"]
["CONDUCTOR_CODE","Value","3/0.080 Sc/Gz - 415V 2Ph","D2"]
["CONDUCTOR_CODE","Value","25Mm² 2C Lvabc - 415V 2Ph","D23"]
["CONDUCTOR_CODE","Value","7/2.00 Hdcu 7/0.080 - 415V 2Ph","D24"]
["CONDUCTOR_CODE","Value","7/3.00 Aaac - 415V 2Ph","D25"]
["CONDUCTOR_CODE","Value","6/1/3.00 Acsr/Gz - 415V 2Ph","D26"]
["CONDUCTOR_CODE","Value","7/2.50 Aaac - 415V 2Ph","D27"]
["CONDUCTOR_CODE","Value","7/3.00 Aac - 415V 2Ph","D28"]
["CONDUCTOR_CODE","Value","7/0.064 Sc/Gz - 415V 2Ph","D3"]
["CONDUCTOR_CODE","Value","7/.104-19/.064 Hdcu - 415V 2Ph","D30"]
["CONDUCTOR_CODE","Value","7/3.75 Aac - 415V 2Ph","D32"]
["CONDUCTOR_CODE","Value","6/1/3.75 Acsr/Gz - 415V 2Ph","D34"]
["CONDUCTOR_CODE","Value","7/3.75 Aaac - 415V 2Ph","D35"]
["CONDUCTOR_CODE","Value","0.06In² Cu Equiv - 415V 2Ph","D38"]
["CONDUCTOR_CODE","Value","19/2.00 Hdcu - 415V 2Ph","D40"]
["CONDUCTOR_CODE","Value","6/4.75+7/1.60 Acsr - 415V 2Ph","D42"]
["CONDUCTOR_CODE","Value","7/4.50 Aaac - 415V 2Ph","D43"]
["CONDUCTOR_CODE","Value","7/4.50 Aac - 415V 2Ph","D44"]
["CONDUCTOR_CODE","Value","7/4.75 Aac - 415V 2Ph","D45"]
["CONDUCTOR_CODE","Value","0.1In² Cu Equiv - 415V 2Ph","D49"]
["CONDUCTOR_CODE","Value","7/0.80 Sc/Gz - 415V 2Ph","D5"]
["CONDUCTOR_CODE","Value","19/3.75 Aaac - 415V 2Ph","D65"]
["CONDUCTOR_CODE","Value","Unknown Oh - 415V 2Ph","D99"]
["CONDUCTOR_CODE","Value","3/4/2.50 Acsr/Gz - 415V 3Ph","E10"]
["CONDUCTOR_CODE","Value","6/1/2.50 Sc/Gz Gldy - 415V 3Ph","E12"]
["CONDUCTOR_CODE","Value","7/1.75 Hdcu - 415V 3Ph","E14"]
["CONDUCTOR_CODE","Value","7/2.25 Aac - 415V 3Ph","E16"]
["CONDUCTOR_CODE","Value","6/1/2.50 Acsr/Gz - 415V 3Ph","E18"]
["CONDUCTOR_CODE","Value","0.035In² Cu Equiv - 415V 3Ph","E19"]
["CONDUCTOR_CODE","Value","3/0.080 Sc/Gz - 415V 3Ph","E2"]
["CONDUCTOR_CODE","Value","4/3/3.00 Acsr/Gz - 415V 2Ph","E20"]
["CONDUCTOR_CODE","Value","25Mm² 4C Lvabc - 415V 3Ph","E23"]
["CONDUCTOR_CODE","Value","7/2.00 Hdcu 7/0.080 - 415V 3Ph","E24"]
["CONDUCTOR_CODE","Value","7/3.00 Aaac - 415V 3Ph","E25"]
["CONDUCTOR_CODE","Value","6/1/3.00 Acsr/Gz - 415V 3Ph","E26"]
["CONDUCTOR_CODE","Value","7/2.50 Aaac - 415V 3Ph","E27"]
["CONDUCTOR_CODE","Value","7/3.00 Aac - 415V 3Ph","E28"]
["CONDUCTOR_CODE","Value","7/0.064 Sc/Gz - 415V 3Ph","E3"]
["CONDUCTOR_CODE","Value","7/.104-19/.064 Hdcu - 415V 3Ph","E30"]
["CONDUCTOR_CODE","Value","7/0.104 Sc/Gz - 415V 3Ph","E31"]
["CONDUCTOR_CODE","Value","7/3.75 Aac - 415V 3Ph","E32"]
["CONDUCTOR_CODE","Value","6/1/3.75 Acsr/Gz - 415V 3Ph","E34"]
["CONDUCTOR_CODE","Value","7/3.75 Aaac - 415V 3Ph","E35"]
["CONDUCTOR_CODE","Value","0.06In² Cu Equiv - 415V 3Ph","E38"]
["CONDUCTOR_CODE","Value","3/2.75 Sc/Gz - 415V 3Ph","E4"]
["CONDUCTOR_CODE","Value","19/2.00 Hdcu - 415V 3Ph","E40"]
["CONDUCTOR_CODE","Value","6/4.75+7/1.60 Acsr - 415V 3Ph","E42"]
["CONDUCTOR_CODE","Value","7/4.50 Aaac - 415V 3Ph","E43"]
["CONDUCTOR_CODE","Value","7/4.50 Aac - 415V 3Ph","E44"]
["CONDUCTOR_CODE","Value","7/4.75 Aac - 415V 3Ph","E45"]
["CONDUCTOR_CODE","Value","37/0.064 Hdcu - 415V 3Ph","E46"]
["CONDUCTOR_CODE","Value","95Mm²  4C Lvabc - 415V 3Ph","E47"]
["CONDUCTOR_CODE","Value","0.1In² Cu Equiv - 415V 3Ph","E49"]
["CONDUCTOR_CODE","Value","7/0.80 Sc/Gz - 415V 3Ph","E5"]
["CONDUCTOR_CODE","Value","19/0.101 Hdcu - 415V 3Ph","E50"]
["CONDUCTOR_CODE","Value","150Mm² 4C Lvabc - 415V 3Ph","E53"]
["CONDUCTOR_CODE","Value","19/3.25 Aac - 415V 3Ph","E54"]
["CONDUCTOR_CODE","Value","150Mm²4C+16Mm²1C Lvabc-415V3Ph","E56"]
["CONDUCTOR_CODE","Value","95Mm²4C+16Mm²1C Lvabc-415V 3Ph","E57"]
["CONDUCTOR_CODE","Value","19/3.75 Aac - 415V 3Ph","E64"]
["CONDUCTOR_CODE","Value","19/3.75 Aaac - 415V 3Ph","E65"]
["CONDUCTOR_CODE","Value","Unknown Oh - 415V 3Ph","E99"]
["CONDUCTOR_CODE","Value","3/2.00 Sc/Gz-12.7Kv Swer","F1"]
["CONDUCTOR_CODE","Value","3/4/2.50 Acsr/Gz-12.7Kv Swer","F10"]
["CONDUCTOR_CODE","Value","6/1/2.50 Acsr/Gz-12.7Kv Swer","F18"]
["CONDUCTOR_CODE","Value","19/2.00 Sc/Gz-12.7Kv Swer","F19"]
["CONDUCTOR_CODE","Value","3/0.080 Sc/Gz-12.7Kv Swer","F2"]
["CONDUCTOR_CODE","Value","6/1/3.00 Acsr/Gz-12.7Kv Swer","F26"]
["CONDUCTOR_CODE","Value","7/2.50 Aaac-12.7Kv Swer","F27"]
["CONDUCTOR_CODE","Value","7/3.00 Aac-12.7Kv Swer","F28"]
["CONDUCTOR_CODE","Value","7/0.064 Sc/Gz-12.7Kv Swer","F3"]
["CONDUCTOR_CODE","Value","7/0.104-19/0.064 Hdcu-12.7Kv","F30"]
["CONDUCTOR_CODE","Value","6/1/3.75 Acsr/Gz-12.7Kv Swer","F34"]
["CONDUCTOR_CODE","Value","3/2.75 Sc/Gz-12.7Kv Swer","F4"]
["CONDUCTOR_CODE","Value","6/4.75+7/1.60 Acsr/Gz-12.7Kv","F42"]
["CONDUCTOR_CODE","Value","7/4.50 Aaac-12.7Kv Swer","F43"]
["CONDUCTOR_CODE","Value","7/4.50 Aac-12.7Kv Swer","F44"]
["CONDUCTOR_CODE","Value","3/4/1.75 Acsr/Gz Hs-12.7Kv","F6"]
["CONDUCTOR_CODE","Value","3/4/0.0661 Acsr/Gz-12.7Kv Swer","F7"]
["CONDUCTOR_CODE","Value","Unknown Oh-12.7Kv Swer","F99"]
["CONDUCTOR_CODE","Value","3/2.00 Sc/Gz-22Kv 2Ph","G1"]
["CONDUCTOR_CODE","Value","3/4/2.50 Acsr/Gz-22Kv 2Ph","G10"]
["CONDUCTOR_CODE","Value","6/1/2.50 Acsr/Gz-22Kv 2Ph","G18"]
["CONDUCTOR_CODE","Value","3/0.080 Sc/Gz-22Kv 2Ph","G2"]
["CONDUCTOR_CODE","Value","7/2.00 Hdcu-22Kv 2Ph","G24"]
["CONDUCTOR_CODE","Value","7/3.00 Aaac-22Kv 2Ph","G25"]
["CONDUCTOR_CODE","Value","6/1/3.00 Acsr/Gz-22Kv 2Ph","G26"]
["CONDUCTOR_CODE","Value","7/2.50 Aaac-22Kv 2Ph","G27"]
["CONDUCTOR_CODE","Value","7/3.00 Aac-22Kv 2Ph","G28"]
["CONDUCTOR_CODE","Value","7/0.104 Or 19/0.064-22Kv 2Ph","G30"]
["CONDUCTOR_CODE","Value","7/3.75 Aac-22Kv 2Ph","G32"]
["CONDUCTOR_CODE","Value","6/1/3.75 Acsr/Gz-22Kv 2Ph","G34"]
["CONDUCTOR_CODE","Value","7/3.75 Aaac-22Kv 2Ph","G35"]
["CONDUCTOR_CODE","Value","3/2.75 Sc/Gz-22Kv 2Ph","G4"]
["CONDUCTOR_CODE","Value","120Mm² Cct-22Kv 2Ph","G41"]
["CONDUCTOR_CODE","Value","6/4.75+7/1.60 Acsr/Gz-22Kv 2Ph","G42"]
["CONDUCTOR_CODE","Value","7/4.50 Aaac-22Kv 2Ph","G43"]
["CONDUCTOR_CODE","Value","7/4.50 Aac-22Kv 2Ph","G44"]
["CONDUCTOR_CODE","Value","3/4/1.75 Acsr/Gz Hs-22Kv 2Ph","G6"]
["CONDUCTOR_CODE","Value","3/4/0.0661 Acsr/Gz-22Kv 2Ph","G7"]
["CONDUCTOR_CODE","Value","Unknown Oh-22Kv 2Ph","G99"]
["CONDUCTOR_CODE","Value","3/2.00 Sc/Gz-22Kv 3Ph","H1"]
["CONDUCTOR_CODE","Value","3/4/2.50 Acsr/Gz-22Kv 3Ph","H10"]
["CONDUCTOR_CODE","Value","6/1/2.50 Sc/Gz Gldy-22Kv 3Ph","H12"]
["CONDUCTOR_CODE","Value","7/1.75 Hdcu-22Kv 3Ph","H14"]
["CONDUCTOR_CODE","Value","7/2.25 Aac-22Kv 3Ph","H16"]
["CONDUCTOR_CODE","Value","6/1/2.50 Acsr/Gz-22Kv 3Ph","H18"]
["CONDUCTOR_CODE","Value","3/0.080 Sc/Gz-22Kv 3Ph","H2"]
["CONDUCTOR_CODE","Value","4/3/3.00 Acsr/Gz-22Kv 3Ph","H20"]
["CONDUCTOR_CODE","Value","4/3/3.75 Acsr/Gz Hs-22Kv 3Ph","H21"]
["CONDUCTOR_CODE","Value","7/2.00 Hdcu-22Kv 3Ph","H24"]
["CONDUCTOR_CODE","Value","7/3.00 Aaac-22Kv 3Ph","H25"]
["CONDUCTOR_CODE","Value","6/1/3.00 Acsr/Gz-22Kv 3Ph","H26"]
["CONDUCTOR_CODE","Value","7/2.50 Aaac-22Kv 3Ph","H27"]
["CONDUCTOR_CODE","Value","7/3.00 Aac-22Kv 3Ph","H28"]
["CONDUCTOR_CODE","Value","7/0.104-19/0.064 Hdcu-22Kv 3Ph","H30"]
["CONDUCTOR_CODE","Value","7/3.75 Aac-22Kv 3Ph","H32"]
["CONDUCTOR_CODE","Value","6/1/3.75 Acsr/Gz-22Kv 3Ph","H34"]
["CONDUCTOR_CODE","Value","7/3.75 Aaac-22Kv 3Ph","H35"]
["CONDUCTOR_CODE","Value","3/2.75 Sc/Gz-22Kv 3Ph","H4"]
["CONDUCTOR_CODE","Value","19/2.00 Hdcu-22Kv 3Ph","H40"]
["CONDUCTOR_CODE","Value","120Mm² Cct-22Kv 3Ph","H41"]
["CONDUCTOR_CODE","Value","6/4.75+7/1.60 Acsr/Gz-22Kv 3Ph","H42"]
["CONDUCTOR_CODE","Value","7/4.50 Aaac-22Kv 3Ph","H43"]
["CONDUCTOR_CODE","Value","7/4.50 Aac-22Kv 3Ph","H44"]
["CONDUCTOR_CODE","Value","7/4.75 Aac-22Kv 3Ph","H45"]
["CONDUCTOR_CODE","Value","19/3.25 Aac-22Kv 3Ph","H54"]
["CONDUCTOR_CODE","Value","19/3.25 Aaac-22Kv 3Ph","H55"]
["CONDUCTOR_CODE","Value","3/4/1.75 Acsr/Gz Hs-22Kv 3Ph","H6"]
["CONDUCTOR_CODE","Value","30/7/3.00 Acsr/Gz-22Kv 3Ph","H62"]
["CONDUCTOR_CODE","Value","19/3.75 Aac-22Kv 3Ph","H64"]
["CONDUCTOR_CODE","Value","19/3.75 Aaac-22Kv 3Ph","H65"]
["CONDUCTOR_CODE","Value","3/4/0.0661 Acsr/Gz-22Kv 3Ph","H7"]
["CONDUCTOR_CODE","Value","Unknown Oh-22Kv 3Ph","H99"]
["CONDUCTOR_CODE","Value","Lv/Sl (Ug) Unknown Ph-415V 3Ph","I99"]
["CONDUCTOR_CODE","Value","7/2.00 Hdcu-33Kv","J24"]
["CONDUCTOR_CODE","Value","6/1/3.00 Acsr/Gz-33Kv","J26"]
["CONDUCTOR_CODE","Value","6/1/3.00 Acsr/Gz - 33Kv","J26E"]
["CONDUCTOR_CODE","Value","7/3.00 Aac-33Kv","J28"]
["CONDUCTOR_CODE","Value","7/3.00 Aac - 33Kv","J28E"]
["CONDUCTOR_CODE","Value","7/0.104 Or 19/0.064 Hdcu-33Kv","J30"]
["CONDUCTOR_CODE","Value","7/0.104 Or 19/0.064 Hdcu33Kv","J30E"]
["CONDUCTOR_CODE","Value","7/0.104 Sc/Gz-33Kv","J31"]
["CONDUCTOR_CODE","Value","7/3.75 Aac-33Kv","J32"]
["CONDUCTOR_CODE","Value","6/1/3.75 Acsr/Gz-33Kv","J34"]
["CONDUCTOR_CODE","Value","6/1/3.75 Acsr/Gz - 33Kv","J34E"]
["CONDUCTOR_CODE","Value","19/2.00 Hdcu (Or 7/0.136)-33Kv","J40"]
["CONDUCTOR_CODE","Value","19/2.00 Hdcu (0R 7/0.136)-33Kv","J40E"]
["CONDUCTOR_CODE","Value","6/4.75+7/1.60 Acsr/Gz-33Kv","J42"]
["CONDUCTOR_CODE","Value","6/4.75+7/1.60 Acsr/Gz33Kv","J42E"]
["CONDUCTOR_CODE","Value","7/4.50 Aaac-33Kv","J43"]
["CONDUCTOR_CODE","Value","7/4.50 Aac-33Kv","J44"]
["CONDUCTOR_CODE","Value","7/4.50 Aac - 33Kv","J44E"]
["CONDUCTOR_CODE","Value","7/4.75 Aac-33Kv","J45"]
["CONDUCTOR_CODE","Value","30/7/2.50 Acsr/Gz-33Kv","J48"]
["CONDUCTOR_CODE","Value","30/7/2.50 Acsr/Gz - 33Kv","J48E"]
["CONDUCTOR_CODE","Value","19/0.101 Hdcu-33Kv","J50"]
["CONDUCTOR_CODE","Value","19/0.101 Hdcu - 33Kv","J50E"]
["CONDUCTOR_CODE","Value","19/3.00 Hdcu-33Kv","J51"]
["CONDUCTOR_CODE","Value","30/7/0.102 Acsr/Gz-33Kv","J52"]
["CONDUCTOR_CODE","Value","30/7/0.102 Acsr/Gz - 33Kv","J52E"]
["CONDUCTOR_CODE","Value","19/3.25 Aac-33Kv","J54"]
["CONDUCTOR_CODE","Value","19/3.25 Aac - 33Kv","J54E"]
["CONDUCTOR_CODE","Value","19/3.25 Aaac-33Kv","J55"]
["CONDUCTOR_CODE","Value","19/0.116 Or 37/0.083 Hdcu-33Kv","J60"]
["CONDUCTOR_CODE","Value","19/0.116 Or 37/0.083 Hdcu33Kv","J60E"]
["CONDUCTOR_CODE","Value","30/7/3.00 Acsr/Gz-33Kv","J62"]
["CONDUCTOR_CODE","Value","30/7/3.00 Acsr/Gz - 33Kv","J62E"]
["CONDUCTOR_CODE","Value","19/3.75 Aac-33Kv","J64"]
["CONDUCTOR_CODE","Value","19/3.75 Aac - 33Kv","J64E"]
["CONDUCTOR_CODE","Value","19/3.75 Aaac-33Kv","J65"]
["CONDUCTOR_CODE","Value","2 X 7/4.50 Aac-33Kv","J66"]
["CONDUCTOR_CODE","Value","2 X 7/4.50 Aac - 33Kv","J66E"]
["CONDUCTOR_CODE","Value","2 X 7/0.183 Aac-33Kv","J67"]
["CONDUCTOR_CODE","Value","2 X 7/0.183 Aac - 33Kv","J67E"]
["CONDUCTOR_CODE","Value","2 X 6/4.75+7/1.60 Acsr/Gz-33Kv","J68"]
["CONDUCTOR_CODE","Value","30/7/3.50 Acsr/Gz-33Kv","J70"]
["CONDUCTOR_CODE","Value","30/7/3.50 Acsr/Gz - 33Kv","J70E"]
["CONDUCTOR_CODE","Value","19/4.75 Aaac-33Kv","J71"]
["CONDUCTOR_CODE","Value","19/4.75 Aac-33Kv","J72"]
["CONDUCTOR_CODE","Value","19/4.75 Aac - 33Kv","J72E"]
["CONDUCTOR_CODE","Value","2 X 19/3.00 Hdcu-33Kv","J73"]
["CONDUCTOR_CODE","Value","2 X 19/3.25 Aac-33Kv","J74"]
["CONDUCTOR_CODE","Value","2 X 19/3.25 Aac - 33Kv","J74E"]
["CONDUCTOR_CODE","Value","2 X 19/3.75 Aac-33Kv","J80"]
["CONDUCTOR_CODE","Value","2 X 19/3.75 Aac - 33Kv","J80E"]
["CONDUCTOR_CODE","Value","61/3.25 Aac-33Kv","J86"]
["CONDUCTOR_CODE","Value","61/3.25 Aac - 33Kv","J86E"]
["CONDUCTOR_CODE","Value","61/3.25 Aaac-33Kv","J87"]
["CONDUCTOR_CODE","Value","2 X 19/4.75 Aac-33Kv","J91"]
["CONDUCTOR_CODE","Value","Unknown Oh-33Kv","J99"]
["CONDUCTOR_CODE","Value","Unknown Oh - 33Kv","J99E"]
["CONDUCTOR_CODE","Value","4/3/3.75 Acsr/Gz Hs-66Kv","K21"]
["CONDUCTOR_CODE","Value","6/1/3.00 Acsr/Gz-66Kv","K26"]
["CONDUCTOR_CODE","Value","6/1/3.00 Acsr/Gz - 66Kv","K26E"]
["CONDUCTOR_CODE","Value","7/0.104 Or 19/0.064 Hdcu-66Kv","K30"]
["CONDUCTOR_CODE","Value","7/0.104 Or 19/0.064 Hdcu66Kv","K30E"]
["CONDUCTOR_CODE","Value","6/1/3.75 Acsr/Gz-66Kv","K34"]
["CONDUCTOR_CODE","Value","6/1/3.75 Acsr/Gz - 66Kv","K34E"]
["CONDUCTOR_CODE","Value","19/2.00 Hdcu (Or 7/0.136)-66Kv","K40"]
["CONDUCTOR_CODE","Value","19/2.00 Hdcu (Or 7/0.136)66Kv","K40E"]
["CONDUCTOR_CODE","Value","6/4.75+7/1.60 Acsr/Gz-66Kv","K42"]
["CONDUCTOR_CODE","Value","6/4.75+7/1.60 Acsr/Gz66Kv","K42E"]
["CONDUCTOR_CODE","Value","7/4.50 Aac66Kv","K43"]
["CONDUCTOR_CODE","Value","7/4.50 Aac-66Kv","K44"]
["CONDUCTOR_CODE","Value","7/4.50 Aac - 66Kv","K44E"]
["CONDUCTOR_CODE","Value","30/7/2.50 Acsr/Gz-66Kv","K48"]
["CONDUCTOR_CODE","Value","30/7/2.50 Acsr/Gz - 66Kv","K48E"]
["CONDUCTOR_CODE","Value","19/0.101 Hdcu-66Kv","K50"]
["CONDUCTOR_CODE","Value","19/0.101 Hdcu - 66Kv","K50E"]
["CONDUCTOR_CODE","Value","19/3.25 Aac-66Kv","K54"]
["CONDUCTOR_CODE","Value","19/3.25 Aac - 66Kv","K54E"]
["CONDUCTOR_CODE","Value","30/7/3.00 Acsr/Gz-66Kv","K62"]
["CONDUCTOR_CODE","Value","30/7/3.00 Acsr/Gz - 66Kv","K62E"]
["CONDUCTOR_CODE","Value","19/3.75 Aac-66Kv","K64"]
["CONDUCTOR_CODE","Value","19/3.75 Aac - 66Kv","K64E"]
["CONDUCTOR_CODE","Value","2 X 7/0.183 Aac-66Kv","K67"]
["CONDUCTOR_CODE","Value","30/7/3.50 Acsr/Gz-66Kv","K70"]
["CONDUCTOR_CODE","Value","30/7/3.50 Acsr/Gz - 66Kv","K70E"]
["CONDUCTOR_CODE","Value","19/4.75 Aaac-66Kv","K71"]
["CONDUCTOR_CODE","Value","19/4.75 Aac-66Kv","K72"]
["CONDUCTOR_CODE","Value","19/4.75 Aac - 66Kv","K72E"]
["CONDUCTOR_CODE","Value","2 X 19/3.25 Aac-66Kv","K74"]
["CONDUCTOR_CODE","Value","2 X 19/3.25 Aac - 66Kv","K74E"]
["CONDUCTOR_CODE","Value","54/7/3.50 Acsr/Gz-66Kv","K85"]
["CONDUCTOR_CODE","Value","61/3.25 Aac-66Kv","K86"]
["CONDUCTOR_CODE","Value","61/3.25 Aac - 66Kv","K86E"]
["CONDUCTOR_CODE","Value","Unknown Oh-66Kv","K99"]
["CONDUCTOR_CODE","Value","12/7/0.118 Acsr/Gz-132Kv","L37"]
["CONDUCTOR_CODE","Value","30/7/0.102 Acsr/Gz-132Kv","L52"]
["CONDUCTOR_CODE","Value","26/2.54+7/1.90 Acsr/Gz-132Kv","L58"]
["CONDUCTOR_CODE","Value","19/0.116 Or37/0.083 Hdcu-132Kv","L60"]
["CONDUCTOR_CODE","Value","37/0.103 Hdcu-132Kv","L61"]
["CONDUCTOR_CODE","Value","30/7/3.00 Acsr/Gz-132Kv","L62"]
["CONDUCTOR_CODE","Value","30/7/3.00 Acsr/Gz - 132Kv","L62E"]
["CONDUCTOR_CODE","Value","2 X 7/4.50 Aac-132Kv","L66"]
["CONDUCTOR_CODE","Value","30/7/3.50 Acsr/Gz-132Kv","L70"]
["CONDUCTOR_CODE","Value","30/7/3.50 Acsr/Gz - 132Kv","L70E"]
["CONDUCTOR_CODE","Value","19/4.75 Aaac-132Kv","L71"]
["CONDUCTOR_CODE","Value","19/4.75 Aac-132Kv","L72"]
["CONDUCTOR_CODE","Value","19/4.75 Aac - 132Kv","L72E"]
["CONDUCTOR_CODE","Value","2 X 19/3.25 Aac-132Kv","L74"]
["CONDUCTOR_CODE","Value","54/7/3.00 Acsr/Gz-132Kv","L77"]
["CONDUCTOR_CODE","Value","2 x 54/7/3.00 ACSR/GZ-132","L78"]
["CONDUCTOR_CODE","Value","54/7/3.50 Acsr/Gz-132Kv","L85"]
["CONDUCTOR_CODE","Value","54/7/3.50 Acsr/Gz - 132Kv","L85E"]
["CONDUCTOR_CODE","Value","61/3.25 Aac-132Kv","L86"]
["CONDUCTOR_CODE","Value","61/3.25 Aac - 132Kv","L86E"]
["CONDUCTOR_CODE","Value","61/3.75 Aac-132Kv","L90"]
["CONDUCTOR_CODE","Value","14/5.6+19/2.88 Al Xtacir-132Kv","L92"]
["CONDUCTOR_CODE","Value","2 X 30/7/3.50 Acsr/Gz-132Kv","L93"]
["CONDUCTOR_CODE","Value","2 X 30/7/3.50 Acsr/Gz132Kv","L93E"]
["CONDUCTOR_CODE","Value","2 X 54/3.53+7/3.53 Acsr-132Kv","L94E"]
["CONDUCTOR_CODE","Value","2 X 54/7/3.50 Acsr/Gz-132Kv","L95"]
["CONDUCTOR_CODE","Value","2 X 54/7/3.50 Acsr/Gz- 132Kv","L95E"]
["CONDUCTOR_CODE","Value","2 X 54/3.00+7/3.00 Acsr-132Kv","L96E"]
["CONDUCTOR_CODE","Value","84/4.44+19/2.66 Tacsr/Ac-132Kv","L97"]
["CONDUCTOR_CODE","Value","2 X 61/3.75 Aac-132Kv","L98"]
["CONDUCTOR_CODE","Value","Unknown Oh-132Kv","L99"]
["CONDUCTOR_CODE","Value","Unknown Oh - 132Kv","L99E"]
["CONDUCTOR_CODE","Value","24C Smof-Oh Pilot","M43"]
["CONDUCTOR_CODE","Value","24C Mmof-Oh Pilot","M44"]
["CONDUCTOR_CODE","Value","60C Smof-Oh Pilot","M45"]
["CONDUCTOR_CODE","Value","144C Adss Ss (17.7Mm)-Oh Pilot","M46"]
["CONDUCTOR_CODE","Value","144C Adss Ms (19.0Mm)-Oh Pilot","M47"]
["CONDUCTOR_CODE","Value","144C Adss Ls (19.9Mm)-Oh Pilot","M48"]
["CONDUCTOR_CODE","Value","7/4.50 4C Hardex-Oh Pilot","M5"]
["CONDUCTOR_CODE","Value","5C Hardex-Oh Pilot","M6"]
["CONDUCTOR_CODE","Value","20C 10 Pair-Oh Pilot","M60"]
["CONDUCTOR_CODE","Value","10C Hardex-Oh Pilot","M7"]
["CONDUCTOR_CODE","Value","30C 15 Pair-Oh Pilot","M70"]
["CONDUCTOR_CODE","Value","24C Opgw (11.4Mm)-Oh Pilot","M8"]
["CONDUCTOR_CODE","Value","50C 25 Pair-Oh Pilot","M83"]
["CONDUCTOR_CODE","Value","48C Opgw (11.4Mm)-Oh Pilot","M9"]
["CONDUCTOR_CODE","Value","Unknown Oh-Oh Pilot","M99"]
["CONDUCTOR_CODE","Value","19/0.064 Hdcu Ohew","N1"]
["CONDUCTOR_CODE","Value","6/1/2.50 Acsr/Gz Ohew","N10"]
["CONDUCTOR_CODE","Value","6/4.75+7/1.60 Acsr Ohew","N12"]
["CONDUCTOR_CODE","Value","7/0.104 Hdcu Ohew","N14"]
["CONDUCTOR_CODE","Value","7/0.104 Sc/Gz Ohew","N15"]
["CONDUCTOR_CODE","Value","7/3.25 Acsr/Gz Ohew","N16"]
["CONDUCTOR_CODE","Value","7/0128 Sc/Gz Ohew","N17"]
["CONDUCTOR_CODE","Value","7/0.144 Acsr/Gz Ohew","N18"]
["CONDUCTOR_CODE","Value","19/0.128 Aac Ohew","N2"]
["CONDUCTOR_CODE","Value","7/4.50 Aac Ohew","N20"]
["CONDUCTOR_CODE","Value","7/4.75 Aaac Ohew","N21"]
["CONDUCTOR_CODE","Value","7/4.75 Aac Ohew","N22"]
["CONDUCTOR_CODE","Value","19/2.14 Cu Annealed Ohew","N24"]
["CONDUCTOR_CODE","Value","7/3.00 Aaac Ohew","N25"]
["CONDUCTOR_CODE","Value","7/3.00 Aac Ohew Xlpe","N26"]
["CONDUCTOR_CODE","Value","70Mm² Sdcu Pvc/Pvc","N27"]
["CONDUCTOR_CODE","Value","19/3.25 Aaac Ohew","N3"]
["CONDUCTOR_CODE","Value","7/3.75 Aaac Ohew","N35"]
["CONDUCTOR_CODE","Value","19/3.25 Aac Ohew","N4"]
["CONDUCTOR_CODE","Value","7/4.50 Aaac Ohew","N43"]
["CONDUCTOR_CODE","Value","50Mm² Aaac Xlpe Ohew","N44"]
["CONDUCTOR_CODE","Value","95Mm² 4C Lvabc Ohew","N47"]
["CONDUCTOR_CODE","Value","7/4.50 4 Core Hardex Ohew","N50"]
["CONDUCTOR_CODE","Value","180Mm² Cct Ohew","N51"]
["CONDUCTOR_CODE","Value","5 Core Hardex Pilot Ohew","N60"]
["CONDUCTOR_CODE","Value","19/3.75 Aac Ohew","N64"]
["CONDUCTOR_CODE","Value","30/7/2.50 Acsr/Gz Ohew","N7"]
["CONDUCTOR_CODE","Value","10 Core Hardex Pilot Ohew","N70"]
["CONDUCTOR_CODE","Value","4/3/3.75 Acsr/Gz Hs Ohew","N8"]
["CONDUCTOR_CODE","Value","24X11.4 Fibre Opgw 68Mm² Ohew","N80"]
["CONDUCTOR_CODE","Value","30/7/3.00 Acsr/Gz Ohew","N9"]
["CONDUCTOR_CODE","Value","48X18.1 Fibre Opgw 185Mm² Ohew","N90"]
["CONDUCTOR_CODE","Value","Unknown Ohew","N99"]
["CONDUCTOR_CODE","Value","70Mm² Cu Xlpe/Pvc-Ug Erth","P1"]
["CONDUCTOR_CODE","Value","2.5Mm² Cu 1C Earth-Ug Erth","P10"]
["CONDUCTOR_CODE","Value","120Mm² Cu 1C Tinned-Ug Erth","P2"]
["CONDUCTOR_CODE","Value","70Mm² Cu 1C Bare Anld-Ug Erth","P24"]
["CONDUCTOR_CODE","Value","95Mm² Cu 1C Bare Anld-Ug Erth","P25"]
["CONDUCTOR_CODE","Value","185Mm² Cu 1C Bare Anld-Ug Erth","P26"]
["CONDUCTOR_CODE","Value","70Mm² Cu Pvc/Pvc-Ug Erth","P27"]
["CONDUCTOR_CODE","Value","240Mm² Cu 1C Xlpe/Pvc-Ug Erth","P3"]
["CONDUCTOR_CODE","Value","120Mm² Cu Pvc/Pvc-Ug Erth","P35"]
["CONDUCTOR_CODE","Value","50Mm² Aaac Xlpe-Ug Erth","P4"]
["CONDUCTOR_CODE","Value","95Mm² Cu 1C Xlpe/Pvc-Ug Erth","P5"]
["CONDUCTOR_CODE","Value","95Mm² Al 1C Xlpe-Ug Erth","P51"]
["CONDUCTOR_CODE","Value","200Mm² Sc/Gz Strap-Ug Erth","P64"]
["CONDUCTOR_CODE","Value","300Mm²Al 3C Ply/Hdpe/S-Ug Erth","P75"]
["CONDUCTOR_CODE","Value","4Mm² Cu 1C Earth-Ug Erth","P8"]
["CONDUCTOR_CODE","Value","37/1.78 Cu 1C-Ug Erth","P83"]
["CONDUCTOR_CODE","Value","6Mm² Cu 1C Earth-Ug Erth","P9"]
["CONDUCTOR_CODE","Value","240Mm²Cu 3C Xlpe/Pvc/Hdpe/S Ue","P97"]
["CONDUCTOR_CODE","Value","Erth Sheath/Screen Capture-Ue","P98"]
["CONDUCTOR_CODE","Value","Lv/Sl (Ug) Unknown Ph-Lv 1Ph","Q99"]
["CONDUCTOR_CODE","Value","6Mm² Cu 1C Pvc 7/1.04 - Lv 1Ph","R1"]
["CONDUCTOR_CODE","Value","16Mm² Al 1C Pvc/Pvc - Lv 1Ph","R10"]
["CONDUCTOR_CODE","Value","35Mm² Cu 4C Pvc/Pvc - Lv 1Ph","R11"]
["CONDUCTOR_CODE","Value","0.04In² Al 3.5C W/Con - Lv 1Ph","R12"]
["CONDUCTOR_CODE","Value","95Mm² 4C Lvabc - Lv 1Ph","R13"]
["CONDUCTOR_CODE","Value","0.04In² Al 3.5C Plysws -Lv 1Ph","R14"]
["CONDUCTOR_CODE","Value","0.06In² Al 3.5C Consac -Lv 1Ph","R15"]
["CONDUCTOR_CODE","Value","19/0.044 Cu 1C Pvc/Pvc -Lv 1Ph","R16"]
["CONDUCTOR_CODE","Value","16Mm² Cu 2C Xlpe/Pvc - Lv 1Ph","R17"]
["CONDUCTOR_CODE","Value","50Mm² Cu 1C Pvc/Pvc - Lv 1Ph","R18"]
["CONDUCTOR_CODE","Value","0.0225In² Cu 2C Pvc/Pvc-Lv 1Ph","R2"]
["CONDUCTOR_CODE","Value","19/0.083 Al 1C Pvc/Pvc -Lv 1Ph","R21"]
["CONDUCTOR_CODE","Value","19/0.083 Al 1C Pvc - Lv 1Ph","R23"]
["CONDUCTOR_CODE","Value","0.15In² Al 3.5C Consac -Lv 1Ph","R25"]
["CONDUCTOR_CODE","Value","95Mm² Al 3.5C Consac - Lv 1Ph","R26"]
["CONDUCTOR_CODE","Value","50Mm² Cu 4C Pvc/Pvc - Lv 1Ph","R28"]
["CONDUCTOR_CODE","Value","19/2.14 Cu 1C Pvc - Lv 1Ph","R29"]
["CONDUCTOR_CODE","Value","7/0.064 Cu 1C Pvc/Pvc - Lv 1Ph","R3"]
["CONDUCTOR_CODE","Value","0.15In² Cu 3.5C Pvc/Pvc-Lv 1Ph","R30"]
["CONDUCTOR_CODE","Value","0.15In² Cu 3.5C Ply/Pvc-Lv 1Ph","R32"]
["CONDUCTOR_CODE","Value","0.2In² Cu 3.5C Pvc/Pvc -Lv 1Ph","R34"]
["CONDUCTOR_CODE","Value","120Mm² Al 3.5C Consac - Lv 1Ph","R35"]
["CONDUCTOR_CODE","Value","0.2In² Al 3.5C Consac - Lv 1Ph","R36"]
["CONDUCTOR_CODE","Value","150Mm² Al 4C Xlpe + 1C -Lv 1Ph","R38"]
["CONDUCTOR_CODE","Value","16Mm² Cu 1C Xlpe/Pvc - Lv 1Ph","R4"]
["CONDUCTOR_CODE","Value","0.2In² Al 1C But Rubber-Lv 1Ph","R41"]
["CONDUCTOR_CODE","Value","0.3In² Al 3.5C Consac - Lv 1Ph","R42"]
["CONDUCTOR_CODE","Value","185Mm² Al 4C Xlpe + 1C -Lv 1Ph","R43"]
["CONDUCTOR_CODE","Value","185Mm² Al 1C Pe/Pvc - Lv 1Ph","R44"]
["CONDUCTOR_CODE","Value","185Mm² Al 3.5C Xlpe - Lv 1Ph","R45"]
["CONDUCTOR_CODE","Value","185Mm² Al 3.5C Consac -Lv 1Ph","R47"]
["CONDUCTOR_CODE","Value","0.2In² Cu 3.5C Ply/Pvc -Lv 1Ph","R48"]
["CONDUCTOR_CODE","Value","0.25In² Cu 3.5C Plysws -Lv 1Ph","R49"]
["CONDUCTOR_CODE","Value","2.25Mm² Cu 2C Pvc Twin -Lv 1Ph","R5"]
["CONDUCTOR_CODE","Value","25Mm² Cu 4C Xlpe/Pvc - Lv 1Ph","R51"]
["CONDUCTOR_CODE","Value","240Mm² Al 3.5C Xlpe - Lv 1Ph","R52"]
["CONDUCTOR_CODE","Value","240mm2 Al 4C XLPE + 1C SL","R54"]
["CONDUCTOR_CODE","Value","240Mm² Cu 1C Sdi Xlpe - Lv 1Ph","R56"]
["CONDUCTOR_CODE","Value","0.3In² Cu 1C Ply/Pvc - Lv 1Ph","R59"]
["CONDUCTOR_CODE","Value","2X16Mm² Cu 1C Pvc/Pvc -Lv 1Ph","R6"]
["CONDUCTOR_CODE","Value","0.3In² Cu 1C Ply/Pvc-Lv 1Ph","R60"]
["CONDUCTOR_CODE","Value","0.4In² Al 3.5C Ply/Pvc -Lv 1Ph","R63"]
["CONDUCTOR_CODE","Value","0.4In² Al 3.5C Plysws - Lv 1Ph","R64"]
["CONDUCTOR_CODE","Value","25Mm² Cu 1C Pvc/Pvc - Lv 1Ph","R66"]
["CONDUCTOR_CODE","Value","300Mm² Al 1C Pe/Pvc - Lv 1Ph","R69"]
["CONDUCTOR_CODE","Value","16Mm² Cu 1C Pvc/Pvc - Lv 1Ph","R7"]
["CONDUCTOR_CODE","Value","400Mm² Al 1C Xlpe/Pvc - Lv 1Ph","R72"]
["CONDUCTOR_CODE","Value","400Mm² Cu 1C Xlpe - Lv 1Ph","R73"]
["CONDUCTOR_CODE","Value","0.5In² Al 1C Pe/Pvc - Lv 1Ph","R74"]
["CONDUCTOR_CODE","Value","0.5In² Cu 1C Ply/Pvc - Lv 1Ph","R75"]
["CONDUCTOR_CODE","Value","0.5In² Al 3C Pa/Pvc - Lv 1Ph","R76"]
["CONDUCTOR_CODE","Value","0.75In² Cu 1C Plysws - Lv 1Ph","R77"]
["CONDUCTOR_CODE","Value","25Mm² Cu 4C Pvc/Pvc - Lv 1Ph","R8"]
["CONDUCTOR_CODE","Value","25Mm² Al 4C Xlpe - Lv 1Ph","R81"]
["CONDUCTOR_CODE","Value","240Mm² Al 4C Xlpe - Lv 1Ph","R84"]
["CONDUCTOR_CODE","Value","16Mm² Cu 2C Con/N Pvc - Lv 1Ph","R9"]
["CONDUCTOR_CODE","Value","4Mm² Cu 2C Pvc/Pvc - Lv 1Ph","R90"]
["CONDUCTOR_CODE","Value","2 X 185Mm² Cu 1C Xlpe - Lv 1Ph","R93"]
["CONDUCTOR_CODE","Value","50Mm² Cu 4C Xlpe/Pvc - Lv 1Ph","R94"]
["CONDUCTOR_CODE","Value","16Mm² Cu 4C Pvc/Pvc - Lv 1Ph","R95"]
["CONDUCTOR_CODE","Value","16Mm² Cu 4C Xlpe/Pvc - Lv 1Ph","R96"]
["CONDUCTOR_CODE","Value","50Mm² Al 4C Xlpe - Lv 1Ph","R97"]
["CONDUCTOR_CODE","Value","Unknown Ug - Lv 1Ph","R99"]
["CONDUCTOR_CODE","Value","6Mm² Cu 1C Pvc 7/1.04 - Lv 2Ph","S1"]
["CONDUCTOR_CODE","Value","35Mm² Cu 4C Pvc/Pvc - Lv 2Ph","S11"]
["CONDUCTOR_CODE","Value","16Mm² Cu 2C Xlpe/Pvc - Lv 2Ph","S17"]
["CONDUCTOR_CODE","Value","50Mm² Cu 1C Pvc/Pvc - Lv 2Ph","S18"]
["CONDUCTOR_CODE","Value","0.06In² Cu 3.5C Plysws -Lv 2Ph","S19"]
["CONDUCTOR_CODE","Value","19/0.083 Al 1C Pvc - Lv 2Ph","S23"]
["CONDUCTOR_CODE","Value","19/2.14 Cu 1C Pvc - Lv 2Ph","S29"]
["CONDUCTOR_CODE","Value","7/0.064 Cu 1C Pvc/Pvc - Lv 2Ph","S3"]
["CONDUCTOR_CODE","Value","0.15In² Cu 3.5C Ply/Pvc-Lv 2Ph","S32"]
["CONDUCTOR_CODE","Value","0.2In² Cu 3.5C Pvc/Pvc -Lv 2Ph","S34"]
["CONDUCTOR_CODE","Value","120Mm² Al 3.5C Consac - Lv 2Ph","S35"]
["CONDUCTOR_CODE","Value","16Mm² Cu 1C Xlpe/Pvc - Lv 2Ph","S4"]
["CONDUCTOR_CODE","Value","185Mm² Al 4C Xlpe+1C - Lv 2Ph","S43"]
["CONDUCTOR_CODE","Value","185Mm² Al 3.5C Xlpe - Lv 2Ph","S45"]
["CONDUCTOR_CODE","Value","25Mm² Cu 4C Xlpe/Pvc - Lv 2Ph","S51"]
["CONDUCTOR_CODE","Value","240Mm² Al 3.5C Xlpe - Lv 2Ph","S52"]
["CONDUCTOR_CODE","Value","240Mm² Al 3.5C Xlpe-Lv 2Ph","S53"]
["CONDUCTOR_CODE","Value","240Mm² Al 4C W/Con Xlpe-Lv 2Ph","S54"]
["CONDUCTOR_CODE","Value","240Mm² Al 3.5C Consac - Lv 2Ph","S55"]
["CONDUCTOR_CODE","Value","16Mm² Cu 1C Pvc/Pvc - Lv 2Ph","S6"]
["CONDUCTOR_CODE","Value","0.4In² Al 3.5C Plysws - Lv 2Ph","S64"]
["CONDUCTOR_CODE","Value","300Mm² Al 1C Pe/Pvc - Lv 2Ph","S69"]
["CONDUCTOR_CODE","Value","16Mm² Cu 4C Pvc/Pvc - Lv 2Ph","S7"]
["CONDUCTOR_CODE","Value","25Mm² Cu 4C Pvc/Pvc - Lv 2Ph","S8"]
["CONDUCTOR_CODE","Value","37/1.78 Cu 1C Pvc/Pvc - Lv 2Ph","S83"]
["CONDUCTOR_CODE","Value","240Mm² Al 4C Xlpe - Lv 2Ph","S84"]
["CONDUCTOR_CODE","Value","7/0.029 Cu 3C Pvc - Lv 2Ph","S88"]
["CONDUCTOR_CODE","Value","16Mm² Cu 2C Con/N Pvc - Lv 2Ph","S9"]
["CONDUCTOR_CODE","Value","50Mm² Cu 4C Xlpe/Pvc - Lv 2Ph","S94"]
["CONDUCTOR_CODE","Value","Unknown Ug - Lv 2Ph","S99"]
["CONDUCTOR_CODE","Value","6Mm² Cu 1C Pvc 7/1.04 - Lv","T1"]
["CONDUCTOR_CODE","Value","16Mm² Al 1C Pvc/Pvc - Lv","T10"]
["CONDUCTOR_CODE","Value","10Mm² Cu 1C 7/1.35 - Lv","T100"]
["CONDUCTOR_CODE","Value","4Mm² Cu 1C (7/0.085) - Lv","T101"]
["CONDUCTOR_CODE","Value","150Mm² Cu 4C - Lv","T102"]
["CONDUCTOR_CODE","Value","120Mm² Cu 1C Sdi - Lv","T103"]
["CONDUCTOR_CODE","Value","70Mm² Cu 4C Xlpe - Lv","T104"]
["CONDUCTOR_CODE","Value","2 X 300Mm² Cu 1C Xlpe - Lv","T105"]
["CONDUCTOR_CODE","Value","300Mm² Cu 4C Xlpe - Lv","T106"]
["CONDUCTOR_CODE","Value","35Mm² Cu 4C Pvc/Pvc - Lv","T11"]
["CONDUCTOR_CODE","Value","0.04In² Al 3.5C Consac Str -Lv","T12"]
["CONDUCTOR_CODE","Value","95Mm² 4C Lvabc - Lv","T13"]
["CONDUCTOR_CODE","Value","0.04In² Al 3.5C Plysws - Lv","T14"]
["CONDUCTOR_CODE","Value","0.06In² Al 3.5C Consac - Lv","T15"]
["CONDUCTOR_CODE","Value","19/0.044 Cu 1C Pvc/Pvc - Lv","T16"]
["CONDUCTOR_CODE","Value","19/0.072 Cu 1C Pvc/Pvc - Lv","T17"]
["CONDUCTOR_CODE","Value","50Mm² Cu 1C Pvc/Pvc - Lv","T18"]
["CONDUCTOR_CODE","Value","0.06In² Cu 3.5C Plysws - Lv","T19"]
["CONDUCTOR_CODE","Value","0.0225In² Cu 2C Pvc/Pvc - Lv","T2"]
["CONDUCTOR_CODE","Value","0.1In² Al 3.5C Consac Str - Lv","T20"]
["CONDUCTOR_CODE","Value","19/0.083 Al 1C Pvc/Pvc Str -Lv","T21"]
["CONDUCTOR_CODE","Value","0.1In² Al 3.5C Consac - Lv","T22"]
["CONDUCTOR_CODE","Value","19/0.083 Al 1C Pvc - Lv","T23"]
["CONDUCTOR_CODE","Value","0.1In² Al 3.5C Ply/Pvc - Lv","T24"]
["CONDUCTOR_CODE","Value","0.15In² Al 3.5C Consac - Lv","T25"]
["CONDUCTOR_CODE","Value","95Mm² Al 3.5C Consac - Lv","T26"]
["CONDUCTOR_CODE","Value","0.1In² Cu 3.5C Ply/Pvc - Lv","T27"]
["CONDUCTOR_CODE","Value","50Mm² Cu 4C Pvc/Pvc - Lv","T28"]
["CONDUCTOR_CODE","Value","19/2.14 Cu 1C Pvc - Lv","T29"]
["CONDUCTOR_CODE","Value","7/0.064 Cu 1C Pvc/Pvc - Lv","T3"]
["CONDUCTOR_CODE","Value","0.15In² Cu 3.5C Pvc/Pvc - Lv","T30"]
["CONDUCTOR_CODE","Value","0.15In² Cu 3.5C Plysws - Lv","T31"]
["CONDUCTOR_CODE","Value","0.15In² Cu 3.5C Ply/Pvc - Lv","T32"]
["CONDUCTOR_CODE","Value","120Mm² Al 3.5C Plysws - Lv","T33"]
["CONDUCTOR_CODE","Value","0.2In² Cu 3.5C Pvc/Pvc - Lv","T34"]
["CONDUCTOR_CODE","Value","120Mm² Al 3.5C Consac - Lv","T35"]
["CONDUCTOR_CODE","Value","0.2In² Al 3.5C Consac - Lv","T36"]
["CONDUCTOR_CODE","Value","0.2In² Al 3.5C Plysws - Lv","T37"]
["CONDUCTOR_CODE","Value","150Mm² Al 4C Xlpe + 1C Sl - Lv","T38"]
["CONDUCTOR_CODE","Value","150Mm² Al 3.5C Consac - Lv","T39"]
["CONDUCTOR_CODE","Value","0.0225In² Cu 4C Plysws - Lv","T4"]
["CONDUCTOR_CODE","Value","0.25In² Al 3.5C Consac - Lv","T40"]
["CONDUCTOR_CODE","Value","0.2In² Al 1C But Rubber - Lv","T41"]
["CONDUCTOR_CODE","Value","0.3In² Al 3.5C Consac - Lv","T42"]
["CONDUCTOR_CODE","Value","185Mm² Al 4C Xlpe + 1C Sl - Lv","T43"]
["CONDUCTOR_CODE","Value","185Mm² Al 1C Pe/Pvc - Lv","T44"]
["CONDUCTOR_CODE","Value","185Mm² Al 3.5C Xlpe - Lv","T45"]
["CONDUCTOR_CODE","Value","0.15In² Cu 1C Pe/Pvc - Lv","T46"]
["CONDUCTOR_CODE","Value","185Mm² Al 3.5C Consac - Lv","T47"]
["CONDUCTOR_CODE","Value","0.1In² Cu 3.5C Ply/Pvc-Lv","T48"]
["CONDUCTOR_CODE","Value","0.25In² Cu 3.5C Plysws - Lv","T49"]
["CONDUCTOR_CODE","Value","16Mm² Cu 1C Xlpe/Pvc - Lv","T5"]
["CONDUCTOR_CODE","Value","0.3In² Al 4C Plysws - Lv","T50"]
["CONDUCTOR_CODE","Value","25Mm² Cu 4C Xlpe/Pvc - Lv","T51"]
["CONDUCTOR_CODE","Value","240Mm² Al 3.5C Xlpe - Lv","T52"]
["CONDUCTOR_CODE","Value","240Mm² Al 3.5C Con/N Xlpe - Lv","T53"]
["CONDUCTOR_CODE","Value","240Mm² Al 4C Xlpe+1C W/Con-Lv","T54"]
["CONDUCTOR_CODE","Value","240Mm² Al 3.5C Consac - Lv","T55"]
["CONDUCTOR_CODE","Value","240Mm² Al 1C Sdi Xlpe - Lv","T56"]
["CONDUCTOR_CODE","Value","240Mm² Al 3.5C Plysws - Lv","T57"]
["CONDUCTOR_CODE","Value","0.3In² Al 1C Pe/Pvc - Lv","T58"]
["CONDUCTOR_CODE","Value","0.3In² Cu 1C Ply/Pvc - Lv","T59"]
["CONDUCTOR_CODE","Value","16Mm² Cu 1C Pvc/Pvc 7/1.70 -Lv","T6"]
["CONDUCTOR_CODE","Value","0.3In² Cu 1C Ply/Pvc-Lv","T60"]
["CONDUCTOR_CODE","Value","0.3In² Cu 3.5C Ply/Pvc - Lv","T61"]
["CONDUCTOR_CODE","Value","0.3In² Cu 3.5C Plysws - Lv","T62"]
["CONDUCTOR_CODE","Value","0.4In² Al 3.5C Ply/Pvc - Lv","T63"]
["CONDUCTOR_CODE","Value","0.4In² Al 3.5C Plysws - Lv","T64"]
["CONDUCTOR_CODE","Value","0.4In² Al 3.5C Consac - Lv","T65"]
["CONDUCTOR_CODE","Value","16Mm² Al 4C - Lv","T66"]
["CONDUCTOR_CODE","Value","0.4In² Cu 3.5C Ply/Pvc - Lv","T67"]
["CONDUCTOR_CODE","Value","0.4In² Cu 3.5C Plysws - Lv","T68"]
["CONDUCTOR_CODE","Value","300Mm² Al 1C Pe/Pvc - Lv","T69"]
["CONDUCTOR_CODE","Value","16Mm² Cu 4C Pvc/Pvc 7/1.70 -Lv","T7"]
["CONDUCTOR_CODE","Value","300Mm² Al 3.5C Con/N Pvc -Lv","T70"]
["CONDUCTOR_CODE","Value","37/2.52 Cu 1C Pvc/Pvc - Lv","T71"]
["CONDUCTOR_CODE","Value","400Mm² Al 1C Xlpe/Pvc - Lv","T72"]
["CONDUCTOR_CODE","Value","400Mm² Cu 1C Xlpe - Lv","T73"]
["CONDUCTOR_CODE","Value","0.5In² Al 1C Pe/Pvc - Lv","T74"]
["CONDUCTOR_CODE","Value","0.5In² Cu 1C Ply/Pvc - Lv","T75"]
["CONDUCTOR_CODE","Value","0.5In² Al 3C Pa/Pvc - Lv","T76"]
["CONDUCTOR_CODE","Value","0.75In² Cu 1C Plysws - Lv","T77"]
["CONDUCTOR_CODE","Value","0.5In² Al 3.5C Plysws - Lv","T78"]
["CONDUCTOR_CODE","Value","0.5In² Al 3.5C Pa/Pvc - Lv","T79"]
["CONDUCTOR_CODE","Value","25Mm² Cu 4C Pvc/Pvc - Lv","T8"]
["CONDUCTOR_CODE","Value","0.5In² Cu 3.5C Plysws - Lv","T80"]
["CONDUCTOR_CODE","Value","25Mm² Al 4C Xlpe - Lv","T81"]
["CONDUCTOR_CODE","Value","37/1.78 Cu 1C Pvc/Pvc - Lv","T83"]
["CONDUCTOR_CODE","Value","240Mm² Al 4C Xlpe - Lv","T84"]
["CONDUCTOR_CODE","Value","185Mm² Al 4C Xlhdpe - Lv","T85"]
["CONDUCTOR_CODE","Value","7/0.067 Cu 3C Pvc/Pvc - Lv","T86"]
["CONDUCTOR_CODE","Value","16Mm² Cu 3.5C Con/N Pvc/Pe -Lv","T87"]
["CONDUCTOR_CODE","Value","7/0.029 Cu 3C Pvc - Lv","T88"]
["CONDUCTOR_CODE","Value","16Mm² Cu 2C Con.Neut Pvc - Lv","T9"]
["CONDUCTOR_CODE","Value","4Mm² Cu 2C Pvc/Pvc - Lv","T90"]
["CONDUCTOR_CODE","Value","37/2.03 Cu 1C Pvc/Pvc - Lv","T91"]
["CONDUCTOR_CODE","Value","150Mm² Al 4C Xlpe - Lv","T92"]
["CONDUCTOR_CODE","Value","185Mm² Al 4C Xlpe - Lv","T93"]
["CONDUCTOR_CODE","Value","50Mm² Cu 4C Xlpe/Pvc - Lv","T94"]
["CONDUCTOR_CODE","Value","16Mm² Cu 4C Pvc/Pvc - Lv","T95"]
["CONDUCTOR_CODE","Value","16Mm² Cu 4C Xlpe/Pvc - Lv","T96"]
["CONDUCTOR_CODE","Value","50Mm² Al 4C Xlpe - Lv","T97"]
["CONDUCTOR_CODE","Value","CONSUMER (UG) 415","T98"]
["CONDUCTOR_CODE","Value","Unknown Ug - Lv","T99"]
["CONDUCTOR_CODE","Value","0.04In² Cu 3C Plysws Blt -11Kv","U1"]
["CONDUCTOR_CODE","Value","0.15In² Cu 3C Plysws-11Kv","U10"]
["CONDUCTOR_CODE","Value","0.2In² Al 3C Plysws-11Kv","U11"]
["CONDUCTOR_CODE","Value","150Mm² Al 3C Plysws-11Kv","U12"]
["CONDUCTOR_CODE","Value","150Mm Al 3C Xlpe/Pvc/H Sc-11Kv","U13"]
["CONDUCTOR_CODE","Value","0.2In² Cu 3C Plysws-11Kv","U14"]
["CONDUCTOR_CODE","Value","0.3In² Al 3C Plysws-11Kv","U15"]
["CONDUCTOR_CODE","Value","0.3In² Al 3C Plyswpvc Scr-11Kv","U16"]
["CONDUCTOR_CODE","Value","240Mm² Al 3C Plysws-11Kv","U17"]
["CONDUCTOR_CODE","Value","0.4In² Al 3C Plysws-11Kv","U18"]
["CONDUCTOR_CODE","Value","240Mm² Al 3C Plyswpvc Scr-11Kv","U19"]
["CONDUCTOR_CODE","Value","0.06In² Cu 3C Plysws-11Kv","U2"]
["CONDUCTOR_CODE","Value","0.3In² Cu 3C Plyswpvc Scr-11Kv","U20"]
["CONDUCTOR_CODE","Value","0.3In² Cu 3C Plysws-11Kv","U21"]
["CONDUCTOR_CODE","Value","0.5In² Al 3C Plyswpvc Scr-11Kv","U22"]
["CONDUCTOR_CODE","Value","0.5In² Al 3C Plysws-11Kv","U23"]
["CONDUCTOR_CODE","Value","300Mm² Al 3C Plysws-11Kv","U24"]
["CONDUCTOR_CODE","Value","300Mm² Al 3C Plyswpvc Scr-11Kv","U25"]
["CONDUCTOR_CODE","Value","0.5In² Cu 3C Plysws-11Kv","U26"]
["CONDUCTOR_CODE","Value","0.5In² Al 3C Pa/Pvc-11Kv","U27"]
["CONDUCTOR_CODE","Value","300Mm² Cu 3C Plyswpvc Scr-11Kv","U28"]
["CONDUCTOR_CODE","Value","150Mm² Al 3C Plyswpvc Scr-11Kv","U29"]
["CONDUCTOR_CODE","Value","0.1In² Al 3C Plysws-11Kv","U3"]
["CONDUCTOR_CODE","Value","500Mm² Al 3C Plysws-11Kv","U30"]
["CONDUCTOR_CODE","Value","500Mm² Al 3C Plyswpvc Scr-11Kv","U31"]
["CONDUCTOR_CODE","Value","400Mm² Cu 3C Plysws-11Kv","U32"]
["CONDUCTOR_CODE","Value","0.3In² Cu 3C Plyswpvc-11Kv","U34"]
["CONDUCTOR_CODE","Value","240Mm² Cu 3C Plysws-11Kv","U35"]
["CONDUCTOR_CODE","Value","0.75In² Al 3C Plysws-11Kv","U36"]
["CONDUCTOR_CODE","Value","300Mm² Al 3C Pa/Pvc Scr-11Kv","U37"]
["CONDUCTOR_CODE","Value","16Mm² Cu 1C Xlpe/Pvc-11Kv","U38"]
["CONDUCTOR_CODE","Value","50Mm² Cu 3C Plysws-11Kv","U4"]
["CONDUCTOR_CODE","Value","185Mm² Cu 3C Ply/Pvc Scr-11Kv","U40"]
["CONDUCTOR_CODE","Value","630Mm Cu 1C Xlpe/Pvc/Hdpe-11Kv","U41"]
["CONDUCTOR_CODE","Value","1.0In² Cu 1C Ply/Pvc-11Kv","U42"]
["CONDUCTOR_CODE","Value","1.25In² Al 1C Ply/Pvc-11Kv","U43"]
["CONDUCTOR_CODE","Value","800Mm² Al 1C Ply/Pvc-11Kv","U44"]
["CONDUCTOR_CODE","Value","800Mm² Cu 1C Ply/Pvc-11Kv","U45"]
["CONDUCTOR_CODE","Value","95Mm² Cu 1C Ply/Pvc-11Kv","U49"]
["CONDUCTOR_CODE","Value","0.1In² Cu 3C Plysws-11Kv","U5"]
["CONDUCTOR_CODE","Value","0.15In² Cu 1C Ply/Pvc-11Kv","U51"]
["CONDUCTOR_CODE","Value","0.3In² Cu 1C Ply/Pvc-11Kv","U53"]
["CONDUCTOR_CODE","Value","0.4In² Cu 1C Ply/Pvc-11Kv","U54"]
["CONDUCTOR_CODE","Value","185Mm² Al 3C Pa/Pvc-11Kv","U58"]
["CONDUCTOR_CODE","Value","0.3In² Cu 3C Ply/Pvc Scr-11Kv","U59"]
["CONDUCTOR_CODE","Value","0.15In² Al 3C Plysws-11Kv","U6"]
["CONDUCTOR_CODE","Value","300Mm² Al 3C Plysws Scr-11Kv","U60"]
["CONDUCTOR_CODE","Value","70Mm² Al 3C Plysws-11Kv","U62"]
["CONDUCTOR_CODE","Value","95Mm² Al 3C Plysws-11Kv","U63"]
["CONDUCTOR_CODE","Value","120Mm² Al 3C Plysws-11Kv","U64"]
["CONDUCTOR_CODE","Value","185Mm² Al 3C Plysws-11Kv","U65"]
["CONDUCTOR_CODE","Value","300Mm² Cu 3C Plysws-11Kv","U66"]
["CONDUCTOR_CODE","Value","95Mm² Al 3C Hvabc Met/Scr-11Kv","U67"]
["CONDUCTOR_CODE","Value","95Mm² Al 3C Pvc-11Kv","U68"]
["CONDUCTOR_CODE","Value","150Mm Cu 1C Xlpe/Pvc/Hdpe-11Kv","U69"]
["CONDUCTOR_CODE","Value","0.0225In² Cu 1C Pe/Pvc Sc-11Kv","U7"]
["CONDUCTOR_CODE","Value","0.4In² Cu 3C Plysws-11Kv","U70"]
["CONDUCTOR_CODE","Value","185Mm Al 3C Xlpe/Pvc/Hdpe-11Kv","U71"]
["CONDUCTOR_CODE","Value","240Mm Al 3C Xlpe/Pvc/Hdpe-11Kv","U72"]
["CONDUCTOR_CODE","Value","185Mm Al 1C Xlpe/Pvc/Hdpe-11Kv","U73"]
["CONDUCTOR_CODE","Value","240Mm² Al 3C Ply/Hdpe Scr-11Kv","U74"]
["CONDUCTOR_CODE","Value","300Mm² Al 3C Ply/Hdpe Scr-11Kv","U75"]
["CONDUCTOR_CODE","Value","300Mm² Cu 3C Ply/Hdpe-11Kv","U76"]
["CONDUCTOR_CODE","Value","240Mm Cu 3C Xlp/Pvc/H Scr-11Kv","U77"]
["CONDUCTOR_CODE","Value","70Mm² Cu 3C Plyswpvc Scr-11Kv","U78"]
["CONDUCTOR_CODE","Value","150Mm² Cu 3C Ply/Pvc-11Kv","U79"]
["CONDUCTOR_CODE","Value","0.06In² Cu 1C Pe/Pvc Scr -11Kv","U8"]
["CONDUCTOR_CODE","Value","185Mm² Cu 3C Plysws-11Kv","U80"]
["CONDUCTOR_CODE","Value","0.2In² Al 1C Ply/Pvc-11Kv","U81"]
["CONDUCTOR_CODE","Value","150Mm Al 1C Xlp/Pvc/H Scr-11Kv","U82"]
["CONDUCTOR_CODE","Value","185Mm Cu 3C Xlpe/Pvc/Hdpe-11Kv","U83"]
["CONDUCTOR_CODE","Value","300Mm Al 3C Xlpe/Pvc/Hdpe-11Kv","U84"]
["CONDUCTOR_CODE","Value","0.25In² Cu 3C Plysws-11Kv","U85"]
["CONDUCTOR_CODE","Value","300Mm Cu 3C Xlp/Pvc/H Scr-11Kv","U86"]
["CONDUCTOR_CODE","Value","95Mm² Al 1C Xlpe, Hdpe-11Kv","U87"]
["CONDUCTOR_CODE","Value","300Mm² Cu 1C Epr-11Kv","U88"]
["CONDUCTOR_CODE","Value","300Mm² Cu 1C Xlpe-11Kv","U89"]
["CONDUCTOR_CODE","Value","95Mm² Cu 3C-11Kv","U9"]
["CONDUCTOR_CODE","Value","35Mm² Cu 3C Xlpe-11Kv","U90"]
["CONDUCTOR_CODE","Value","330Mm² Cu 1C Xlpe 0.5In²-11Kv","U91"]
["CONDUCTOR_CODE","Value","240Mm Al 3C Xlp/Pvc/H Scr-11Kv","U97"]
["CONDUCTOR_CODE","Value","0.0225In² Cu 3C Plysws-11Kv","U98"]
["CONDUCTOR_CODE","Value","Unknown Ug-11Kv","U99"]
["CONDUCTOR_CODE","Value","150Mm Al 3C Xlp/Pvc/H Scr-22Kv","V12"]
["CONDUCTOR_CODE","Value","240Mm Al 3C Xlp/Pvc/H Scr-22Kv","V17"]
["CONDUCTOR_CODE","Value","300Mm Al 3C Xlp/Pvc/H Scr-22Kv","V25"]
["CONDUCTOR_CODE","Value","0.2In² Cu 3C Plysws-22Kv","V40"]
["CONDUCTOR_CODE","Value","0.25In² Cu 3C Plysws-22Kv","V41"]
["CONDUCTOR_CODE","Value","240Mm Cu 3C Xlp/Pvc/H Scr-22Kv","V97"]
["CONDUCTOR_CODE","Value","Unknown Ug-22Kv","V99"]
["CONDUCTOR_CODE","Value","0.25In² Cu 3C Hsl - 33Kv","W11"]
["CONDUCTOR_CODE","Value","0.4In² Al 3C Hsl - 33Kv","W12"]
["CONDUCTOR_CODE","Value","0.4In² Al 3C Hsl-33Kv","W12E"]
["CONDUCTOR_CODE","Value","2 X 0.6In² Al 3C Oil - 33Kv","W14"]
["CONDUCTOR_CODE","Value","150Mm Cu 1C Xlp/Pvc/H Scr-33Kv","W19"]
["CONDUCTOR_CODE","Value","185Mm² Cu 3C Hsl-33Kv","W20"]
["CONDUCTOR_CODE","Value","0.3In² Al 3C Gas-33Kv","W22"]
["CONDUCTOR_CODE","Value","0.45In² Al 3C Gas-33Kv","W30"]
["CONDUCTOR_CODE","Value","0.45In² Al 3C Gas - 33Kv","W30E"]
["CONDUCTOR_CODE","Value","300Mm² Cu 3C Hsl-33Kv","W31"]
["CONDUCTOR_CODE","Value","300Mm² Cu 3C Hsl - 33Kv","W31E"]
["CONDUCTOR_CODE","Value","0.5In² Cu 3C Hsl-33Kv","W32"]
["CONDUCTOR_CODE","Value","0.55In² Al 3C Gas-33Kv","W33"]
["CONDUCTOR_CODE","Value","300Mm² Cu 1C Ply/Pvc-33Kv","W34"]
["CONDUCTOR_CODE","Value","0.6In² Cu 3C Hsl-33Kv","W35"]
["CONDUCTOR_CODE","Value","0.6In² Cu 3C Hsl - 33Kv","W35E"]
["CONDUCTOR_CODE","Value","300Mm Cu 1C Xlp/Pvc/H Scr-33Kv","W36"]
["CONDUCTOR_CODE","Value","300Mm Cu 1C Xlp/Lat/H Scr-33Kv","W37"]
["CONDUCTOR_CODE","Value","350Mm² Cu 3C H-33Kv","W40"]
["CONDUCTOR_CODE","Value","350Mm² Cu 3C H - 33Kv","W40E"]
["CONDUCTOR_CODE","Value","0.4In² Cu 3C Gas-33Kv","W41"]
["CONDUCTOR_CODE","Value","2 X 0.25In² Cu 3C Hsl-33Kv","W42"]
["CONDUCTOR_CODE","Value","2 X 0.25In² Cu 3C Hsl33Kv","W42E"]
["CONDUCTOR_CODE","Value","0.6In² Cu 1C Plys-33Kv","W43"]
["CONDUCTOR_CODE","Value","0.6In² Cu 3C Gas-33Kv","W44"]
["CONDUCTOR_CODE","Value","2 X 0.3In² Al 3C Gas-33Kv","W46"]
["CONDUCTOR_CODE","Value","2 X 300Mm² Al 3C H-33Kv","W48"]
["CONDUCTOR_CODE","Value","800Mm Al 1C Xlp/Pvc/H Scr-33Kv","W49"]
["CONDUCTOR_CODE","Value","800Mm Al 1C Xlp/Pvc/H Scr33Kv","W49E"]
["CONDUCTOR_CODE","Value","1.0In² Cu 1C Plys-33Kv","W51"]
["CONDUCTOR_CODE","Value","500Mm Al 1C Xlp/Pvc/H Scr-33Kv","W52"]
["CONDUCTOR_CODE","Value","630Mm² Al 1C Pials-33Kv","W59"]
["CONDUCTOR_CODE","Value","630Mm Al 1C Xlp/Pvc/H Scr-33Kv","W60"]
["CONDUCTOR_CODE","Value","630Mm Al 1C Xlp/Pvc/H Scr33Kv","W60E"]
["CONDUCTOR_CODE","Value","1.0In² Cu 1C Gas-33Kv","W61"]
["CONDUCTOR_CODE","Value","800Mm Cu 1C Xlpe/Lat/Hdpe-33Kv","W66"]
["CONDUCTOR_CODE","Value","2 X 240Mm² Cu 3C Xlpe-33Kv","W69"]
["CONDUCTOR_CODE","Value","2 X 300Mm² Cu 3C Hsl-33Kv","W70"]
["CONDUCTOR_CODE","Value","2 X 0.5In² Cu 3C Hsl-33Kv","W71"]
["CONDUCTOR_CODE","Value","2 X 0.5In² Cu 3C Hsl33Kv","W71E"]
["CONDUCTOR_CODE","Value","2X500 Al 1C Xlp/Pvc/H Scr-33Kv","W72"]
["CONDUCTOR_CODE","Value","2X500 Al 1C Xlp/Pvc/H Scr33Kv","W72E"]
["CONDUCTOR_CODE","Value","300mm2 Cu 1C XLPE/CWS/APL/HDPE","W73"]
["CONDUCTOR_CODE","Value","2 X 0.4In² Cu 3C Gas-33Kv","W80"]
["CONDUCTOR_CODE","Value","630Mm Cu 1C Xlp/Pvc/H Scr-33Kv","W81"]
["CONDUCTOR_CODE","Value","630Mm Cu 1C Xlp/Pvc/H Scr33Kv","W81E"]
["CONDUCTOR_CODE","Value","2 X 350Mm² Cu 3C H-33Kv","W82"]
["CONDUCTOR_CODE","Value","2 X 350Mm² Cu 3C H - 33Kv","W82E"]
["CONDUCTOR_CODE","Value","2X630 Cu 1C Xlp/Pvc/H Scr-33Kv","W83"]
["CONDUCTOR_CODE","Value","0.6In Cu 3C+1C Gas-33Kv","W89"]
["CONDUCTOR_CODE","Value","0.6In² Cu 3C+1C Gas-33Kv","W89E"]
["CONDUCTOR_CODE","Value","2 X 0.6In² Cu 3C Gas-33Kv","W90"]
["CONDUCTOR_CODE","Value","2 X 0.6In² Cu 3C Gas33Kv","W90E"]
["CONDUCTOR_CODE","Value","2 X 630Mm² Al 1C Pials-33Kv","W91"]
["CONDUCTOR_CODE","Value","2X630 Al 1C Xlp/Pvc/H Scr-33Kv","W92"]
["CONDUCTOR_CODE","Value","2X800 Cu 1C Xlp/Pvc/H Scr-33Kv","W93"]
["CONDUCTOR_CODE","Value","800Mm Cu 1C Xlp/Pvc/H Scr-33Kv","W94"]
["CONDUCTOR_CODE","Value","800Mm Cu 1C Xlp/Pvc/H Scr33Kv","W94E"]
["CONDUCTOR_CODE","Value","1200 Cu 1C Xlp/Pvc/H Scr-33Kv","W95"]
["CONDUCTOR_CODE","Value","Unknown Ug-33Kv-33Kv","W99"]
["CONDUCTOR_CODE","Value","0.6In² Cu 3C Gas - 66Kv","X30"]
["CONDUCTOR_CODE","Value","0.6In² Cu 1C Oil/Pi - 66Kv","X50"]
["CONDUCTOR_CODE","Value","0.6In² Cu 1C Oil/Pi-66Kv","X50E"]
["CONDUCTOR_CODE","Value","0.75In² Cu 1C Oil/Pvc - 66Kv","X57"]
["CONDUCTOR_CODE","Value","630 Al 1C Xlp/Pvc/H Scr - 66Kv","X63"]
["CONDUCTOR_CODE","Value","630 Cu 1C Xlp/Pvc/H Scr - 66Kv","X70"]
["CONDUCTOR_CODE","Value","630 Cu 1C Xlp/Pvc/H Scr-66Kv","X70E"]
["CONDUCTOR_CODE","Value","Unknown Ug - 66Kv","X99"]
["CONDUCTOR_CODE","Value","300 Al 1C Xlp/Pvc/H Scr-132Kv","Y30"]
["CONDUCTOR_CODE","Value","300 Cu 1C Xlp/Pvc/H Scr-132Kv","Y40"]
["CONDUCTOR_CODE","Value","355Mm² Cu 1C Sols-132Kv","Y42"]
["CONDUCTOR_CODE","Value","400Mm² Cu 1C Xlpe/H Scr-132Kv","Y44"]
["CONDUCTOR_CODE","Value","430Mm² Cu 1C Soas-132Kv","Y46"]
["CONDUCTOR_CODE","Value","630 Cu 1C Xlp/Pvc/H Scr-132Kv","Y50"]
["CONDUCTOR_CODE","Value","630 Cu 1C Xlp/L-Shth Hdp-132Kv","Y57"]
["CONDUCTOR_CODE","Value","800Mm² Cu 1C Xlpe/Lat/H-132Kv","Y58"]
["CONDUCTOR_CODE","Value","1200 Cu 1C Xlp/Pvc/H Scr-132Kv","Y60"]
["CONDUCTOR_CODE","Value","Unknown Ug-132Kv","Y99"]
["CONDUCTOR_CODE","Value","8 Core Pilot -Ug Pilot","Z10"]
["CONDUCTOR_CODE","Value","10 Core Pilot -Ug Pilot","Z15"]
["CONDUCTOR_CODE","Value","12 Core Pilot -Ug Pilot","Z20"]
["CONDUCTOR_CODE","Value","12 Core Fibre Optic -Ug Pilot","Z21"]
["CONDUCTOR_CODE","Value","6 Core Fibre Optic -Ug Pilot","Z22"]
["CONDUCTOR_CODE","Value","6C Embed Fibre Optic -Ug Pilot","Z23"]
["CONDUCTOR_CODE","Value","15 Core Pilot -Ug Pilot","Z25"]
["CONDUCTOR_CODE","Value","19 Core Pilot -Ug Pilot","Z30"]
["CONDUCTOR_CODE","Value","25 Core Pilot -Ug Pilot","Z36"]
["CONDUCTOR_CODE","Value","30 Core Pilot -Ug Pilot","Z40"]
["CONDUCTOR_CODE","Value","144 Core Smof -Ug Pilot","Z42"]
["CONDUCTOR_CODE","Value","24 Core Smof -Ug Pilot","Z43"]
["CONDUCTOR_CODE","Value","24 Core Mmof -Ug Pilot","Z44"]
["CONDUCTOR_CODE","Value","60 Core Fibre Smof -Ug Pilot","Z45"]
["CONDUCTOR_CODE","Value","144 Core Adss Ss -Ug Pilot","Z46"]
["CONDUCTOR_CODE","Value","144 Core Adss Ms -Ug Pilot","Z47"]
["CONDUCTOR_CODE","Value","144 Core Adss Ls -Ug Pilot","Z48"]
["CONDUCTOR_CODE","Value","Unknown Type Ug -Ug Pilot","Z49"]
["CONDUCTOR_CODE","Value","4 Core Pilot -Ug Pilot","Z5"]
["CONDUCTOR_CODE","Value","48 Core Smof -Ug Pilot","Z51"]
["CONDUCTOR_CODE","Value","288 Core Smartcore - Ug Pilot","Z52"]
["CONDUCTOR_CODE","Value","Cu 16C 8 Pr Pilot -Ug Pilot","Z58"]
["CONDUCTOR_CODE","Value","5 Core Pilot -Ug Pilot","Z6"]
["CONDUCTOR_CODE","Value","Cu 20C 10 Pr Pilot -Ug Pilot","Z60"]
["CONDUCTOR_CODE","Value","6 Core Pilot -Ug Pilot","Z7"]
["CONDUCTOR_CODE","Value","Cu 30C 15 Pr Pilot -Ug Pilot","Z70"]
["CONDUCTOR_CODE","Value","Cu 40C 20 Pr Pilot -Ug Pilot","Z80"]
["CONDUCTOR_CODE","Value","Cu 50C 25 Pr Pilot -Ug Pilot","Z83"]
["CONDUCTOR_CODE","Value","Cu 52C 26 Pr Pilot -Ug Pilot","Z84"]
["CONDUCTOR_CODE","Value","Cu 60C 30 Pr Pilot -Ug Pilot","Z85"]
["CONDUCTOR_CODE","Value","Cu 92C 46 Pr Pilot -Ug Pilot","Z89"]
["CONDUCTOR_CODE","Value","Cu 100C 50 Pr Pilot -Ug Pilot","Z90"]
["CONDUCTOR_CODE","Value","Cu 104C 52 Pr Pilot -Ug Pilot","Z91"]
["CONDUCTOR_CODE","Value","Cu 108C 54 Pr Pilot -Ug Pilot","Z92"]
["CONDUCTOR_CODE","Value","Cu 160C 80 Pr Pilot -Ug Pilot","Z93"]
["CONDUCTOR_CODE","Value","Cu 200C 100 Pr Pilot -Ug Pilot","Z94"]
["CONDUCTOR_CODE","Value","Unknown Ug -Ug Pilot","Z99"]
["CONNECTION_TYPE","Header","Description","Code"]
["CONNECTION_TYPE","Value","Bolted Lugs","BOLT"]
["CONNECTION_TYPE","Value","Cabac (Shear Off Bolts)","CAB"]
["CONNECTION_TYPE","Value","Pat Danamberg (Switch)","PATD"]
["CONNECTION_TYPE","Value","Tappat (2 Way) Termination Kit","TAPP"]
["CONNECTION_TYPE","Value","Tappat (Single Switch)","TSW1"]
["CONNECTION_TYPE","Value","Tappat (Double Switch)","TSW2"]
["CONNECTION_TYPE","Value","Unknown","UNKNOWN"]
["CONTROL_METHOD","Header","Description","Code"]
["CONTROL_METHOD","Value","Local","LOCAL"]
["CONTROL_METHOD","Value","Remote","REMOTE"]
["CONTROL_METHOD","Value","Unknown","UNKNOWN"]
["COOLING_TYPE","Header","Description","Code"]
["COOLING_TYPE","Value","Air Forced","AF"]
["COOLING_TYPE","Value","Air Forced/Oil Natural","AFON"]
["COOLING_TYPE","Value","Air Natural","AN"]
["COOLING_TYPE","Value","Air Natural/Oil Natural","ANON"]
["COOLING_TYPE","Value","Oil Directed/Air Forced","ODAF"]
["COOLING_TYPE","Value","Oil Forced Air Forced","OFAF"]
["COOLING_TYPE","Value","Oil Forced Air Natural","OFAN"]
["COOLING_TYPE","Value","Oil Forced Blast","OFB"]
["COOLING_TYPE","Value","Oil Forced Directed Air Forced","OFDAF"]
["COOLING_TYPE","Value","Oil Natural","OILNAT"]
["COOLING_TYPE","Value","Oil Natural Air Forced","ONAF"]
["COOLING_TYPE","Value","Oil Natural Air Natural","ONAN"]
["COOLING_TYPE","Value","Unknown","UNKNOWN"]
["CORE_TYPE","Header","Description","Code"]
["CORE_TYPE","Value","5 Linbed (Butt Or Stepped)","5"]
["CORE_TYPE","Value","Cut C Shape (Stepped Sire/End)","C"]
["CORE_TYPE","Value","Cut E Shape (Stepped Sire/End)","E"]
["CORE_TYPE","Value","Spiral (Rect Butt Or Stepped)","S"]
["CORE_TYPE","Value","Strip (Rect Butt Or Stepped)","T"]
["CORE_TYPE","Value","Unknown","UNKNOWN"]
["CORE_TYPE","Value","Y 120 Degs (Stepped Sides/Ends","YES"]
["CREEK_CROSSING","Header","Description","Code"]
["CREEK_CROSSING","Value","No","NO"]
["CREEK_CROSSING","Value","Yes","YES"]
["CT_POSITION","Header","Description","Code"]
["CT_POSITION","Value","External","EXT"]
["CT_POSITION","Value","Internal","INT"]
["CT_POSITION","Value","No Cts","NA"]
["CT_POSITION","Value","Unknown","UNKNOWN"]
["CUSTOMER_METERBOX","Header","Description","Code"]
["CUSTOMER_METERBOX","Value","No","NO"]
["CUSTOMER_METERBOX","Value","Yes","YES"]
["DAMPER_TYPE","Header","Description","Code"]
["DAMPER_TYPE","Value","Spiral Vibration Damper","SPIRAL"]
["DAMPER_TYPE","Value","Stockbridge Vibration Damper","STOCKBRIDGE"]
["DELUGE_SHWR_TYPE","Header","Description","Code"]
["DELUGE_SHWR_TYPE","Value","Mains Water","MAINSWAT"]
["DELUGE_SHWR_TYPE","Value","Tank","TANK"]
["DELUGE_SHWR_TYPE","Value","Unknown","UNKNOWN"]
["DSUB_INSTALL_TYPE","Header","Description","Code"]
["DSUB_INSTALL_TYPE","Value","Cottage","COTTAGE"]
["DSUB_INSTALL_TYPE","Value","Indoor","INDOOR"]
["DSUB_INSTALL_TYPE","Value","Kiosk","KIOSK"]
["DSUB_INSTALL_TYPE","Value","Pad","PAD"]
["DSUB_INSTALL_TYPE","Value","Pole","POLE"]
["EARTH_COND_SIZE","Header","Description","Code"]
["EARTH_COND_SIZE","Value","16","16"]
["EARTH_COND_SIZE","Value","25","25"]
["EARTH_COND_SIZE","Value","35","35"]
["EARTH_COND_SIZE","Value","50","50"]
["EARTH_COND_SIZE","Value","70","70"]
["EARTH_COND_SIZE","Value","95","95"]
["EARTH_COND_SIZE","Value","120","120"]
["EARTH_CONFIGURATION","Header","Description","Code"]
["EARTH_CONFIGURATION","Value","Cmen Earthing","CMEN"]
["EARTH_CONFIGURATION","Value","Common Earth Grid","COMMON"]
["EARTH_CONFIGURATION","Value","Multiple Earthed Neutral","MEN"]
["EARTH_CONFIGURATION","Value","Separate Earth Grid","SEPARATE"]
["EARTH_CONFIGURATION","Value","Special Earth Grid","SPECIAL"]
["EARTH_CONFIGURATION","Value","Swer Delta Earth Grid","SWER_EARTH"]
["EARTH_CONFIGURATION","Value","Unknown","UNKNOWN"]
["EASEMENT_TYPE","Header","Description","Code"]
["EASEMENT_TYPE","Value","Endeavour Energy","EE"]
["EASEMENT_TYPE","Value","Other Authority","OTA"]
["EASEMENT_TYPE","Value","Statutory Transfer","STT"]
["ENVIRONRISK","Header","Description","Code"]
["ENVIRONRISK","Value","Aboriginal","ABORIGINAL"]
["ENVIRONRISK","Value","Flora and Fauna","FLORAFAUNA"]
["ENVIRONRISK","Value","NSW State Heritage","NSWSTATEHERI"]
["ENVIRONRISK","Value","Coastal Wetland","SEPP14WET"]
["EQUIPMENT_FUNCTION","Header","Description","Code"]
["EQUIPMENT_FUNCTION","Value","Communications","COMMUNICATIONS"]
["EQUIPMENT_FUNCTION","Value","Distribution","DISTRIBUTION"]
["EQUIPMENT_FUNCTION","Value","Extended Service","EXTENDED_SERVICE"]
["EQUIPMENT_FUNCTION","Value","Streetlighting","STREETLIGHTING"]
["EQUIPMENT_FUNCTION","Value","Transmission","TRANSMISSION"]
["EQUIPMENT_FUNCTION","Value","Unknown","UNKNOWN"]
["EQUIPMENT_OWNER","Header","Description","Code"]
["EQUIPMENT_OWNER","Value","Artc","ARTC"]
["EQUIPMENT_OWNER","Value","Ausconnex Owned Equipment","AUSCONNEX"]
["EQUIPMENT_OWNER","Value","Ausgrid Owned Equipment","AUSGRID"]
["EQUIPMENT_OWNER","Value","Country Energy","COUNTRY_ENERGY"]
["EQUIPMENT_OWNER","Value","Delta Electricity Owned Equip","DELTA_ELECTRICITY"]
["EQUIPMENT_OWNER","Value","Endeavour Energy","EE"]
["EQUIPMENT_OWNER","Value","Energy Australia","ENERGY_AUSTRALIA"]
["EQUIPMENT_OWNER","Value","Essential Energy","ESSENTIAL_ENERGY"]
["EQUIPMENT_OWNER","Value","NBN","NBN"]
["EQUIPMENT_OWNER","Value","Not Owned by EE","NOTEE"]
["EQUIPMENT_OWNER","Value","Optus Owned Equipment","OPTUS"]
["EQUIPMENT_OWNER","Value","Privately Owned Equipment","PRIVATE"]
["EQUIPMENT_OWNER","Value","Railcorp","RAILCORP"]
["EQUIPMENT_OWNER","Value","RMS","RMS"]
["EQUIPMENT_OWNER","Value","RTA","RTA"]
["EQUIPMENT_OWNER","Value","SRA","SRA"]
["EQUIPMENT_OWNER","Value","Sydney Water","SYDNEY_WATER"]
["EQUIPMENT_OWNER","Value","Telstra Owned Equipment","TELSTRA"]
["EQUIPMENT_OWNER","Value","Transgrid Owned Equipment","TRANSGRID"]
["EQUIPMENT_OWNER","Value","Unknown","UNKNOWN"]
["EQUIPMENT_OWNER","Value","Water Nsw","WATER_NSW"]
["FENCE_TYPE","Header","Description","Code"]
["FENCE_TYPE","Value","Colourbond","CBOND"]
["FENCE_TYPE","Value","Chain-Wire","CWIRE"]
["FENCE_TYPE","Value","EXTERNALLY OWNED FENCE","EXTERNAL_OWNED_FENCE"]
["FENCE_TYPE","Value","Unknown","UNKNOWN"]
["FENCE_TYPE","Value","358 Weld Mesh","WELD_MESH"]
["FUSE_TYPE","Header","Description","Code"]
["FUSE_TYPE","Value","Bare Element Fuse Type","BARE"]
["FUSE_TYPE","Value","Powder Fuse Type","POWDER"]
["GATE","Header","Description","Code"]
["GATE","Value","No","NO"]
["GATE","Value","Yes","YES"]
["HEATER","Header","Description","Code"]
["HEATER","Value","No","NO"]
["HEATER","Value","Yes","YES"]
["HORIZ_SUPPORT_TARIFF","Header","Description","Code"]
["HORIZ_SUPPORT_TARIFF","Value","Leg -Owned, const, maint by EE","1"]
["HORIZ_SUPPORT_TARIFF","Value","Leg -Gift by cust, maint by EE","2"]
["HORIZ_SUPPORT_TARIFF","Value","Annuity-Own, Const Maint By EE","3"]
["HORIZ_SUPPORT_TARIFF","Value","Annuity-Gift By Cus, Mnt By EE","4"]
["HORIZ_SUPPORT_TARIFF","Value","Owned By Cust & Maint By EE","6"]
["HV_BUSHING_LOCATION","Header","Description","Code"]
["HV_BUSHING_LOCATION","Value","Lid Mounted","LID"]
["HV_BUSHING_LOCATION","Value","Pocket Mounted","POC"]
["HV_BUSHING_LOCATION","Value","Unknown","UNKNOWN"]
["HV_BUSH_TYPE","Header","Description","Code"]
["HV_BUSH_TYPE","Value","Bushing Shroud/Cover As Insul","BUSHS"]
["HV_BUSH_TYPE","Value","Bushing Thru Tx Walls As Insul","BUSHTX"]
["HV_BUSH_TYPE","Value","Bushing Well","BUSHW"]
["HV_BUSH_TYPE","Value","Cable Boxes/Disco Chamber","CBOXD"]
["HV_BUSH_TYPE","Value","Cable Boxes - Multiple","CBOXM"]
["HV_BUSH_TYPE","Value","Cable Box - Single","CBOXS"]
["HV_BUSH_TYPE","Value","Cable Tails","CTAILS"]
["HV_BUSH_TYPE","Value","Epoxy Resin Hazmyr To Dwg","EPOXYRES"]
["HV_BUSH_TYPE","Value","Glands Wiping Metal No Box","GLANDS"]
["HV_BUSH_TYPE","Value","Moulded Lv Term Into Cast","MOULDLV"]
["HV_BUSH_TYPE","Value","Standard Porcelain Or Similar","PORCELAIN"]
["HV_BUSH_TYPE","Value","Xlpe J/Shrink Termination","XLPE"]
["HV_DROPPER_TYPE","Header","Description","Code"]
["HV_DROPPER_TYPE","Value","Bare Conductor","BARE"]
["HV_DROPPER_TYPE","Value","Cable With Black Tubing","CBLACK"]
["HV_DROPPER_TYPE","Value","Cct Cable","CCT"]
["HV_DROPPER_TYPE","Value","Polythene","POLY"]
["HV_DROPPER_TYPE","Value","Polythene With High Wind Lugs","POLYHW"]
["HV_DROPPER_TYPE","Value","Solid Rod","SOLID"]
["HV_DROPPER_TYPE","Value","Unknown","UNKNOWN"]
["HV_FUSE_ELEMENT","Header","Description","Code"]
["HV_FUSE_ELEMENT","Value","3.00","3.00"]
["HV_FUSE_ELEMENT","Value","3.15","3.15"]
["HV_FUSE_ELEMENT","Value","5.00","5.00"]
["HV_FUSE_ELEMENT","Value","8.00","8.00"]
["HV_FUSE_ELEMENT","Value","10.00","10.00"]
["HV_FUSE_ELEMENT","Value","16.00","16.00"]
["HV_FUSE_ELEMENT","Value","20.00","20.00"]
["HV_FUSE_ELEMENT","Value","25.00","25.00"]
["HV_FUSE_ELEMENT","Value","30.00","30.00"]
["HV_FUSE_ELEMENT","Value","31.50","31.50"]
["HV_FUSE_ELEMENT","Value","40.00","40.00"]
["HV_FUSE_ELEMENT","Value","50.00","50.00"]
["HV_FUSE_ELEMENT","Value","63.00","63.00"]
["HV_FUSE_ELEMENT","Value","80.00","80.00"]
["HV_FUSE_ELEMENT","Value","100.00","100.00"]
["ICELOAD_AREA","Header","Description","Code"]
["ICELOAD_AREA","Value","No","NO"]
["ICELOAD_AREA","Value","Yes","YES"]
["INSULATING_MEDIUM","Header","Description","Code"]
["INSULATING_MEDIUM","Value","Air","AIR"]
["INSULATING_MEDIUM","Value","Epoxy - Insulating Medium","EPOXYINSMED"]
["INSULATING_MEDIUM","Value","Oil","OIL"]
["INSULATING_MEDIUM","Value","Room Temp","ROOM_TEMP"]
["INSULATING_MEDIUM","Value","R Temp","RTM"]
["INSULATING_MEDIUM","Value","R Temp Fluid - Insulating Med","R_TEMP"]
["INSULATING_MEDIUM","Value","Sf6","SF6"]
["INSULATING_MEDIUM","Value","Silicone","SILICONE"]
["INSULATING_MEDIUM","Value","Unknown","UNKNOWN"]
["INSULATING_MEDIUM","Value","Vacuum","VACUUM"]
["ISQUAREDT_VALUE","Header","Description","Code"]
["ISQUAREDT_VALUE","Value","Off","OFF"]
["ISQUAREDT_VALUE","Value","On","ON"]
["LANTERN_LOCALITY","Header","Description","Code"]
["LANTERN_LOCALITY","Value","Amphitheatre","AMPITHEATRE"]
["LANTERN_LOCALITY","Value","Arcade","ARCADE"]
["LANTERN_LOCALITY","Value","Bridge","BRIDGE"]
["LANTERN_LOCALITY","Value","Bus Shelter","BUSSHELTER"]
["LANTERN_LOCALITY","Value","Bus Terminal","BUSTERM"]
["LANTERN_LOCALITY","Value","Car Park","CARPARK"]
["LANTERN_LOCALITY","Value","Cemetery","CEMETERY"]
["LANTERN_LOCALITY","Value","Church Grounds","CHURCH"]
["LANTERN_LOCALITY","Value","Clock","CLOCK"]
["LANTERN_LOCALITY","Value","Council Chambers","COUNCIL"]
["LANTERN_LOCALITY","Value","Endeavour Energy Fsc / Office","EE_FSC"]
["LANTERN_LOCALITY","Value","Lane Way","LANE"]
["LANTERN_LOCALITY","Value","Other Location","OTHER"]
["LANTERN_LOCALITY","Value","Oval","OVAL"]
["LANTERN_LOCALITY","Value","Park","PARK"]
["LANTERN_LOCALITY","Value","Path Way","PATHWAY"]
["LANTERN_LOCALITY","Value","Pedestrian Mall","PEDMALL"]
["LANTERN_LOCALITY","Value","Pedestrian Crossing","PEDX"]
["LANTERN_LOCALITY","Value","Picnic Grounds","PICNIC"]
["LANTERN_LOCALITY","Value","Pool Area","POOL"]
["LANTERN_LOCALITY","Value","Private Land","PRIVLAND"]
["LANTERN_LOCALITY","Value","Private Road","PRIVROAD"]
["LANTERN_LOCALITY","Value","Reserve","RESERVE"]
["LANTERN_LOCALITY","Value","Right Of Way","RIGHT_OF_WAY"]
["LANTERN_LOCALITY","Value","Road","ROAD"]
["LANTERN_LOCALITY","Value","Stormwater Channel","STORM"]
["LANTERN_LOCALITY","Value","Sub Way","SUBWAY"]
["LANTERN_LOCALITY","Value","Taxi Shelter","TAXISHELTER"]
["LANTERN_LOCALITY","Value","Toilets","TOILET"]
["LANTERN_LOCALITY","Value","Tunnel","TUNNEL"]
["LANTERN_LOCALITY","Value","Underpass","UNDERPASS"]
["LANTERN_LOCALITY","Value","Unknown","UNKNOWN"]
["LANTERN_LOCALITY","Value","War Memorial","WARMEM"]
["LANTERN_LOCALITY","Value","Wharf","WHARF"]
["LANTERN_TYPE","Header","Description","Code"]
["LANTERN_TYPE","Value","Flood-Light","FLOODLIGHT"]
["LANTERN_TYPE","Value","Major Road - Lantern Type","MAJOR_RD"]
["LANTERN_TYPE","Value","Minor Road - Lantern Type","MINOR_RD"]
["LANTERN_TYPE","Value","Other - Lantern Type","OTHER"]
["LANTERN_TYPE","Value","Post-Top","POST"]
["LANTERN_TYPE","Value","Prestige - Lantern Type","PRESTIGE"]
["LANTERN_TYPE","Value","Special - Lantern Type","SPECIAL"]
["LANTERN_TYPE","Value","Unknown","UNKNOWN"]
["LIVELINE_BRIDGES","Header","Description","Code"]
["LIVELINE_BRIDGES","Value","Fitted","FITTED"]
["LIVELINE_BRIDGES","Value","Fitted At Tapoff","FITTED_AT_TAPOFF"]
["LIVELINE_BRIDGES","Value","Fitted At Tapoff And Sub","FITTED_AT_TAPOFF_SUB"]
["LIVELINE_BRIDGES","Value","Unknown","UNKNOWN"]
["LIVELINE_DISCONNECTORS","Header","Description","Code"]
["LIVELINE_DISCONNECTORS","Value","No","NO"]
["LIVELINE_DISCONNECTORS","Value","Yes","YES"]
["LOAD_TYPE","Header","Description","Code"]
["LOAD_TYPE","Value","Bulk Supply (33/66Kv)","BULK_SUPPLY"]
["LOAD_TYPE","Value","Commercial Load","COMMLOAD"]
["LOAD_TYPE","Value","High Density Residential Load","HD_RESIDENTIAL"]
["LOAD_TYPE","Value","High Voltage Customer","HVC"]
["LOAD_TYPE","Value","Industrial Load","INDUSTRIAL"]
["LOAD_TYPE","Value","Irrigation Load","IRRIGATION"]
["LOAD_TYPE","Value","Residential Load","RESIDENTIAL_LOAD"]
["LOAD_TYPE","Value","Special Designated Load","SPEC"]
["LOAD_TYPE","Value","Special Load","SPECIAL"]
["LOAD_TYPE","Value","Switching Station","SW_STATION"]
["LOAD_TYPE","Value","Unknown","UNKNOWN"]
["LOAD_TYPE","Value","Urd Load","URD"]
["LOCAL_GOV_AUTHORITY_NAME","Header","Description","Code"]
["LOCAL_GOV_AUTHORITY_NAME","Value","Bankstown City Council","BANKSTOWN"]
["LOCAL_GOV_AUTHORITY_NAME","Value","Bathurst Regional Council","BATHURST"]
["LOCAL_GOV_AUTHORITY_NAME","Value","Blacktown City Council","BLACKTOWN"]
["LOCAL_GOV_AUTHORITY_NAME","Value","Blue Mountains City Council","BLUE_MOUNTAINS"]
["LOCAL_GOV_AUTHORITY_NAME","Value","Camden Municipal Council","CAMDEN"]
["LOCAL_GOV_AUTHORITY_NAME","Value","Campbelltown City Council","CAMPBELLTOWN"]
["LOCAL_GOV_AUTHORITY_NAME","Value","Canterbury Bankstown Council","CANTERBURY_BANKSTOWN"]
["LOCAL_GOV_AUTHORITY_NAME","Value","Cumberland City Council","CUMBERLAND"]
["LOCAL_GOV_AUTHORITY_NAME","Value","Fairfield City Council","FAIRFIELD"]
["LOCAL_GOV_AUTHORITY_NAME","Value","Hawkesbury City Council","HAWKESBURY"]
["LOCAL_GOV_AUTHORITY_NAME","Value","The Hills Shire Council","HILLS_SHIRE"]
["LOCAL_GOV_AUTHORITY_NAME","Value","Holroyd Municipality","HOLROYD"]
["LOCAL_GOV_AUTHORITY_NAME","Value","Hornsby Shire Council","HORNSBY"]
["LOCAL_GOV_AUTHORITY_NAME","Value","Kiama Municipal Council","KIAMA"]
["LOCAL_GOV_AUTHORITY_NAME","Value","Lithgow City Council","LITHGOW"]
["LOCAL_GOV_AUTHORITY_NAME","Value","Liverpool City Council","LIVERPOOL"]
["LOCAL_GOV_AUTHORITY_NAME","Value","Mid Western Regional Council","MID_WESTERN"]
["LOCAL_GOV_AUTHORITY_NAME","Value","Oberon Council","OBERON"]
["LOCAL_GOV_AUTHORITY_NAME","Value","Parramatta City Council","PARRAMATTA"]
["LOCAL_GOV_AUTHORITY_NAME","Value","Penrith City Council","PENRITH"]
["LOCAL_GOV_AUTHORITY_NAME","Value","Ryde City Council","RYDE"]
["LOCAL_GOV_AUTHORITY_NAME","Value","Rylstone Shire","RYLSTONE"]
["LOCAL_GOV_AUTHORITY_NAME","Value","Shellharbour Municipal Council","SHELLHARBOUR"]
["LOCAL_GOV_AUTHORITY_NAME","Value","Shoalhaven City Council","SHOALHAVEN"]
["LOCAL_GOV_AUTHORITY_NAME","Value","Singleton Council","SINGLETON"]
["LOCAL_GOV_AUTHORITY_NAME","Value","Wingecarribee Shire Council","WINGCARRIBEE"]
["LOCAL_GOV_AUTHORITY_NAME","Value","Wollondilly Shire Council","WOLLONDILLY"]
["LOCAL_GOV_AUTHORITY_NAME","Value","Wollongong City Council","WOLLONGONG"]
["LOCATION_ZONE","Header","Description","Code"]
["LOCATION_ZONE","Value","Commercial","COMMERCIAL"]
["LOCATION_ZONE","Value","High Risk","HIGH_RISK"]
["LOCATION_ZONE","Value","Industrial","INDUSTRIAL_LOC"]
["LOCATION_ZONE","Value","Residential","RESIDENTIAL_ZONE"]
["LOCATION_ZONE","Value","Unknown","UNKNOWN"]
["LOCK","Header","Description","Code"]
["LOCK","Value","BF3 Lock","BF3"]
["LOCK","Value","BF4 Lock","BF4"]
["LOCK","Value","Endeavour Energy","EE"]
["LOCK","Value","EL Lock","EL"]
["LOCK","Value","Land Holder/Private","LANDHOLDERPRIV"]
["LOCK","Value","Local Council Lock","LOCAL_COUNCIL_LOCK"]
["LOCK","Value","M23 Lock","M23"]
["LOCK","Value","NA1 Lock","NA1"]
["LOCK","Value","NA2 Lock","NA2"]
["LOCK","Value","No Lock","NO_LOCK"]
["LOCK","Value","National Parks Illawarra","NPI"]
["LOCK","Value","National Parks Other","NPO"]
["LOCK","Value","NPWS Lock","NPWS"]
["LOCK","Value","Private Lock","PRIVATE_LOCK"]
["LOCK","Value","Rural Fire Service","RFS"]
["LOCK","Value","Sydney Catchment Auth Lock","SCA"]
["LOCK","Value","State Forest Lock","STATE_FOREST_LOCK"]
["LOCK","Value","State Rail Lock","STATE_RAIL_LOCK"]
["LOCK","Value","Sydney Water","SYDNEY_WATER"]
["LSI","Header","Description","Code"]
["LSI","Value","No","NO"]
["LSI","Value","Yes","YES"]
["LV_BUSH_TYPE","Header","Description","Code"]
["LV_BUSH_TYPE","Value","Bushing Shroud/Cover As Insul","BUSHS"]
["LV_BUSH_TYPE","Value","Bushing Thru Tx Walls As Insul","BUSHTX"]
["LV_BUSH_TYPE","Value","Bushing Well","BUSHW"]
["LV_BUSH_TYPE","Value","Cable Boxes/Disco Chamber","CBOXD"]
["LV_BUSH_TYPE","Value","Cable Boxes - Multiple","CBOXM"]
["LV_BUSH_TYPE","Value","Cable Box - Single","CBOXS"]
["LV_BUSH_TYPE","Value","Cable Tails","CTAILS"]
["LV_BUSH_TYPE","Value","Epoxy Resin Hazmyr To Dwg","EPOXYRES"]
["LV_BUSH_TYPE","Value","Glands Wiping Metal No Box","GLANDS"]
["LV_BUSH_TYPE","Value","Moulded Lv Term Into Cast","MOULDLV"]
["LV_BUSH_TYPE","Value","Standard Porcelain Or Similar","PORCELAIN"]
["LV_BUSH_TYPE","Value","Xlpe J/Shrink Termination","XLPE"]
["LV_FUSE_SIZE","Header","Description","Code"]
["LV_FUSE_SIZE","Value","100","100"]
["LV_FUSE_SIZE","Value","160","160"]
["LV_FUSE_SIZE","Value","200","200"]
["LV_FUSE_SIZE","Value","250","250"]
["LV_FUSE_SIZE","Value","315","315"]
["LV_FUSE_SIZE","Value","400","400"]
["LV_FUSE_SIZE","Value","600","600"]
["LV_FUSE_SIZE","Value","63","63"]
["LV_FUSE_SIZE","Value","80","80"]
["LV_SWITCHGEAR_CONFIG","Header","Description","Code"]
["LV_SWITCHGEAR_CONFIG","Value","Circuit Breaker","CB"]
["LV_SWITCHGEAR_CONFIG","Value","2 Circuit Breakers","CB+CB"]
["LV_SWITCHGEAR_CONFIG","Value","Circuit Breaker + Fuse Strip","CB+F"]
["LV_SWITCHGEAR_CONFIG","Value","C/Breaker + 2 Fuse Strips","CB+FF"]
["LV_SWITCHGEAR_CONFIG","Value","Compact Lv Switchgear","COMPACT"]
["LV_SWITCHGEAR_CONFIG","Value","4 Fuse Strips And Isolator","FFIFF"]
["LV_SWITCHGEAR_CONFIG","Value","2 Fuse Strips And Isolator","FIF"]
["LV_SWITCHGEAR_CONFIG","Value","3 Fuse Strips And Isolator","FIFF"]
["MDI_CONNECTION","Header","Description","Code"]
["MDI_CONNECTION","Value","Mdi Installed On Each Trf","MDI"]
["MDI_CONNECTION","Value","Mdi Measures 1 Trf Only","MULTI"]
["MDI_CONNECTION","Value","Mdi Measures All Transformers","MULTIALL"]
["MDI_CONNECTION","Value","No","NO"]
["MDI_CONNECTION","Value","No Mdi Fitted On Substation","NO_MDI"]
["MDI_CONNECTION","Value","1 Mdi On Regulator (11Kv 1 Ph)","REG11_1_1"]
["MDI_CONNECTION","Value","1 Mdi On Regulator (11Kv 3 Ph)","REG11_1_3"]
["MDI_CONNECTION","Value","2 Mdis On Regulator (11Kv 3Ph)","REG11_2_3"]
["MDI_CONNECTION","Value","3 Mdis On Regulator (11Kv 3Ph)","REG11_3_3"]
["MDI_CONNECTION","Value","2 Mdis On Regulator (22Kv 3Ph)","REG22_2_3"]
["MDI_CONNECTION","Value","Unknown","UNKNOWN"]
["MOUNTING","Header","Description","Code"]
["MOUNTING","Value","Column (2Nd And Subsequent)","COL2ND"]
["MOUNTING","Value","Column (Major Road)","COLUMN_MAJOR"]
["MOUNTING","Value","Column (Minor Road)","COLUMN_MINOR"]
["MOUNTING","Value","Column (Bill At Pole Rate)","COLUMN_POLE"]
["MOUNTING","Value","Folding Column (Major Rd)","FCOLMAJ"]
["MOUNTING","Value","Folding Column (Minor Rd)","FCOLMIN"]
["MOUNTING","Value","Other Mounting (Wall, Etc)","OTHER"]
["MOUNTING","Value","Pole Mounted","POLE"]
["MOUNTING","Value","Pole (2Nd & Subsequent Lant)","POLE2ND"]
["MOUNTING","Value","Special Mount (Refer Comments)","SPECMOUNT"]
["MOUNTING","Value","Unknown","UNKNOWN"]
["NAILED_TYPE","Header","Description","Code"]
["NAILED_TYPE","Value","Eltek Nailed Pole","ELTEK_NAILED_POLE"]
["NAILED_TYPE","Value","Nil Re-Instatement","NONE_RE_INST"]
["NAILED_TYPE","Value","Oz-C Splinted Pole","OZ_C_SPLINTED_POLE"]
["NAILED_TYPE","Value","Pole Foundations","POLE_FOUNDATIONS"]
["NAILED_TYPE","Value","Rebutted Pole","REBUTTED_POLE"]
["NAILED_TYPE","Value","Uam","UAM"]
["NUMBER_OF_CORES","Header","Description","Code"]
["NUMBER_OF_CORES","Value","1","1"]
["NUMBER_OF_CORES","Value","2","2"]
["NUMBER_OF_CORES","Value","3","3"]
["NUMBER_OF_CORES","Value","4","4"]
["OHL_INSPECTION","Header","Description","Code"]
["OHL_INSPECTION","Value","O/H Line Inspection Every 1Yr","1_YR_CHECK"]
["OHL_INSPECTION","Value","O/H Line Inspection Every 3Yrs","3_YR_CHECK"]
["OHL_INSPECTION","Value","O/H Line Inspection Every 5Yrs","5_YR_CHECK"]
["OIL_SPEC","Header","Description","Code"]
["OIL_SPEC","Value","000637","000637"]
["OIL_SPEC","Value","As","AS"]
["OIL_SPEC","Value","As1761","AS1761"]
["OIL_SPEC","Value","As1767","AS1767"]
["OIL_SPEC","Value","Asc","ASC"]
["OIL_SPEC","Value","Asc62","ASC62"]
["OIL_SPEC","Value","Distr","DISTR"]
["OIL_SPEC","Value","Origtx","ORIGTX"]
["OIL_SPEC","Value","Recond","RECOND"]
["OIL_SPEC","Value","Recot","RECOT"]
["OIL_SPEC","Value","Recotx","RECOTX"]
["OIL_SPEC","Value","Rectox","RECTOX"]
["OIL_SPEC","Value","Regotx","REGOTX"]
["OIL_SPEC","Value","Rexotx","REXOTX"]
["OIL_SPEC","Value","Rl","RL"]
["OIL_SPEC","Value","Rocotx","ROCOTX"]
["OIL_SPEC","Value","Unknown","UNKNOWN"]
["OPERATING_VOLTAGE","Header","Description","Code"]
["OPERATING_VOLTAGE","Value","0","0"]
["OPERATING_VOLTAGE","Value","5","5"]
["OPERATING_VOLTAGE","Value","12","12"]
["OPERATING_VOLTAGE","Value","24","24"]
["OPERATING_VOLTAGE","Value","30","30"]
["OPERATING_VOLTAGE","Value","32","32"]
["OPERATING_VOLTAGE","Value","48","48"]
["OPERATING_VOLTAGE","Value","50","50"]
["OPERATING_VOLTAGE","Value","110","110"]
["OPERATING_VOLTAGE","Value","120","120"]
["OPERATING_VOLTAGE","Value","130","130"]
["OPERATING_VOLTAGE","Value","230","230"]
["OPERATING_VOLTAGE","Value","240","240"]
["OPERATING_VOLTAGE","Value","250","250"]
["OPERATING_VOLTAGE","Value","400","400"]
["OPERATING_VOLTAGE","Value","415","415"]
["OPERATING_VOLTAGE","Value","430","430"]
["OPERATING_VOLTAGE","Value","433","433"]
["OPERATING_VOLTAGE","Value","500","500"]
["OPERATING_VOLTAGE","Value","3300","3300"]
["OPERATING_VOLTAGE","Value","6600","6600"]
["OPERATING_VOLTAGE","Value","11000","11000"]
["OPERATING_VOLTAGE","Value","12700","12700"]
["OPERATING_VOLTAGE","Value","22000","22000"]
["OPERATING_VOLTAGE","Value","33000","33000"]
["OPERATING_VOLTAGE","Value","66000","66000"]
["OPERATING_VOLTAGE","Value","72500","72500"]
["OPERATING_VOLTAGE","Value","132000","132000"]
["OPERATING_VOLTAGE","Value","330000","330000"]
["OP_HANDLE_LOCATION","Header","Description","Code"]
["OP_HANDLE_LOCATION","Value","Ground Level Handle Position","GROUND"]
["OP_HANDLE_LOCATION","Value","Mid Pole Handle Position","MID_POLE"]
["OP_HANDLE_LOCATION","Value","No Operating Handle Fitted","NO_HANDLE"]
["PCB_FREE","Header","Description","Code"]
["PCB_FREE","Value","Equipment Is Not Pcb Free","NO"]
["PCB_FREE","Value","Yes","YES"]
["PHASE_CONNECTION","Header","Description","Code"]
["PHASE_CONNECTION","Value","Single Ph Conn (Ph Not Record)","1_PHASE"]
["PHASE_CONNECTION","Value","Three Phase Connected","3_PHASE"]
["PHASE_CONNECTION","Value","Connected To C Phase (Blue)","BLUE_(C)_PHASE"]
["PHASE_CONNECTION","Value","Single Ph Conn (Blue/Red Ph)","B_R_1_PHASE"]
["PHASE_CONNECTION","Value","Connected To A Phase (Red)","RED_(A)_PHASE"]
["PHASE_CONNECTION","Value","Single Ph Conn (Red/White Ph)","R_W_1_PHASE"]
["PHASE_CONNECTION","Value","Swer","SWER"]
["PHASE_CONNECTION","Value","Unknown","UNKNOWN"]
["PHASE_CONNECTION","Value","Connected To B Phase (White)","WHITE_(B)_PHASE"]
["PHASE_CONNECTION","Value","Single Ph Con (White/Blue Ph)","W_B_1_PHASE"]
["PHASE_ROTATION","Header","Description","Code"]
["PHASE_ROTATION","Value","Not Applicable","NA"]
["PHASE_ROTATION","Value","Red Blue White","RBW"]
["PHASE_ROTATION","Value","Red White Blue","RWB"]
["PHASE_ROTATION","Value","Unknown","UNKNOWN"]
["PILLAR_BASE","Header","Description","Code"]
["PILLAR_BASE","Value","Aluminium","ALUMINIUM"]
["PILLAR_BASE","Value","Concrete","CONCRETE"]
["PILLAR_BASE","Value","Plastic","PLASTIC"]
["PILLAR_BASE","Value","Steel","STEEL"]
["PILLAR_BASE","Value","Unknown","UNKNOWN"]
["PILLAR_ENCLOSURE","Header","Description","Code"]
["PILLAR_ENCLOSURE","Value","Aluminium","ALUMINIUM"]
["PILLAR_ENCLOSURE","Value","Concrete","CONCRETE"]
["PILLAR_ENCLOSURE","Value","Fibreglass","FIBREGLASS"]
["PILLAR_ENCLOSURE","Value","Plastic","PLASTIC"]
["PILLAR_ENCLOSURE","Value","Steel","STEEL"]
["PILLAR_ENCLOSURE","Value","Unknown","UNKNOWN"]
["PILLAR_FUNCTION","Header","Description","Code"]
["PILLAR_FUNCTION","Value","Mains","MAINS"]
["PILLAR_FUNCTION","Value","Service","SERVICE"]
["PILLAR_FUNCTION","Value","Streetlight","STREETLIGHT"]
["PILLAR_FUNCTION","Value","Switch - Double","SWITCH_DOUBLE"]
["PILLAR_FUNCTION","Value","Switch - Single","SWITCH_SINGLE"]
["PILLAR_FUNCTION","Value","Switch - Triple","SWITCH_TRIPLE"]
["PILLAR_FUNCTION","Value","Unknown","UNKNOWN"]
["PILLAR_MOUNTING","Header","Description","Code"]
["PILLAR_MOUNTING","Value","Above Ground","ABOVE_GROUND"]
["PILLAR_MOUNTING","Value","Below Ground","BELOW_GROUND"]
["PILLAR_MOUNTING","Value","Unknown","UNKNOWN"]
["PILLAR_MOUNTING","Value","Wall","WALL"]
["POLETYPE","Header","Description","Code"]
["POLETYPE","Value","Cca (Hard Wood) Pole","CCA_HARDWOOD"]
["POLETYPE","Value","Cca (Soft Wood) Pole","CCA_SOFTWOOD"]
["POLETYPE","Value","Composite Fibre Pole","COMPOSITE"]
["POLETYPE","Value","Concrete (Pre-Stressed) Pole","CONCRETE_PS"]
["POLETYPE","Value","Concrete (Slack Cage) Pole","CONCRETE_SC"]
["POLETYPE","Value","Concrete (Semi-Stressed) Pole","CONCRETE_SS"]
["POLETYPE","Value","Creosote (H&C Dip) Pole","CREOSOTE_HCD"]
["POLETYPE","Value","Creosote (Ht/Lt) Pole","CREOSOTE_HTLT"]
["POLETYPE","Value","Creosote (Pec) Pole","CREOSOTE_PEC"]
["POLETYPE","Value","Desapped Durable","DES_DURABLE"]
["POLETYPE","Value","Natural Round","NAT_ROUND"]
["POLETYPE","Value","Pentachloraphenol (Pcp) Pole","PCP_POLE"]
["POLETYPE","Value","Pine Treated Pole","PINE_TREATED"]
["POLETYPE","Value","Square Sawn Customer Wood Pole","SQ_SAWN_CUST_WD"]
["POLETYPE","Value","Steel Pole","STEEL"]
["POLETYPE","Value","Wood Pole","WOOD"]
["POLE_DISC_MISSING","Header","Description","Code"]
["POLE_DISC_MISSING","Value","No","NO"]
["POLE_DISC_MISSING","Value","Yes","YES"]
["POLE_EQUIP_FUNCTION","Header","Description","Code"]
["POLE_EQUIP_FUNCTION","Value","Communications","COMMUNICATIONS"]
["POLE_EQUIP_FUNCTION","Value","Distribution","DISTRIBUTION"]
["POLE_EQUIP_FUNCTION","Value","Extended Service","EXTENDED_SERVICE"]
["POLE_EQUIP_FUNCTION","Value","Streetlighting","STREETLIGHTING"]
["POLE_EQUIP_FUNCTION","Value","Transmission","TRANSMISSION"]
["POLE_EQUIP_FUNCTION","Value","Unknown","UNKNOWN"]
["POLE_FUNCTION","Header","Description","Code"]
["POLE_FUNCTION","Value","Main Switchboard Pole","MAIN_SWITCHBOARD_POLE"]
["POLE_FUNCTION","Value","Ordinary Pole","ORDINARY_POLE"]
["POLE_FUNCTION","Value","Square Sawn Timber Pole","SS_TIMBER_POLE"]
["POLE_FUNCTION","Value","Stayed Pole","STAYED_POLE"]
["POLE_FUNCTION","Value","Stay Pole","STAY_POLE"]
["POLE_FUNCTION","Value","Sub-Main Pole","SUB_MAIN_POLE"]
["POLE_SPECIES","Header","Description","Code"]
["POLE_SPECIES","Value","Blackbutt","BB"]
["POLE_SPECIES","Value","Bloodwood, Brown","BD"]
["POLE_SPECIES","Value","Ironbark, Broadleaved Red","BI"]
["POLE_SPECIES","Value","Bloodwood","BW"]
["POLE_SPECIES","Value","Box, Coast Grey","CB"]
["POLE_SPECIES","Value","Concrete Pole","CP"]
["POLE_SPECIES","Value","Box, Grey","GB"]
["POLE_SPECIES","Value","Gum, Grey","GG"]
["POLE_SPECIES","Value","Ironbark, Grey","GI"]
["POLE_SPECIES","Value","Ironbark","IB"]
["POLE_SPECIES","Value","Messmate","MS"]
["POLE_SPECIES","Value","Ironbark, Narrowleaved Re","NI"]
["POLE_SPECIES","Value","Pine, Radiata","PR"]
["POLE_SPECIES","Value","Ironbark, Red","RI"]
["POLE_SPECIES","Value","Mahogany, Red","RM"]
["POLE_SPECIES","Value","Stringybark, Red","RS"]
["POLE_SPECIES","Value","Bloodwood, Red","RW"]
["POLE_SPECIES","Value","Gum, Spotted","SG"]
["POLE_SPECIES","Value","Stringybark, Blueleaved","SL"]
["POLE_SPECIES","Value","Mahogany, Southern","SM"]
["POLE_SPECIES","Value","Stringybark, Silvertop","SS"]
["POLE_SPECIES","Value","Steel Pole","STEEL"]
["POLE_SPECIES","Value","Gum, Sydney Blue","SY"]
["POLE_SPECIES","Value","Turpentine","TP"]
["POLE_SPECIES","Value","Tallowwood","TW"]
["POLE_SPECIES","Value","Mahogany, White","WM"]
["POLE_SPECIES","Value","Stringybark, White","WS"]
["POLE_SPECIES","Value","Box, White","WX"]
["POLE_SPECIES","Value","Unknown Type","XX"]
["POLE_SPECIES","Value","Box, Yellow","YB"]
["POLE_SPECIES","Value","Stringybark, Yellow","YS"]
["POLE_TYPE","Header","Description","Code"]
["POLE_TYPE","Value","Cca (Hard Wood) Pole","CCA_HARDWOOD"]
["POLE_TYPE","Value","Cca (Soft Wood) Pole","CCA_SOFTWOOD"]
["POLE_TYPE","Value","Composite Fibre Pole","COMPOSITE"]
["POLE_TYPE","Value","Concrete (Pre-Stressed) Pole","CONCRETE_PS"]
["POLE_TYPE","Value","Concrete (Slack Cage) Pole","CONCRETE_SC"]
["POLE_TYPE","Value","Concrete (Semi-Stressed) Pole","CONCRETE_SS"]
["POLE_TYPE","Value","Creosote (H&C Dip) Pole","CREOSOTE_HCD"]
["POLE_TYPE","Value","Creosote (Ht/Lt) Pole","CREOSOTE_HTLT"]
["POLE_TYPE","Value","Creosote (Pec) Pole","CREOSOTE_PEC"]
["POLE_TYPE","Value","Desapped Durable","DES_DURABLE"]
["POLE_TYPE","Value","Natural Round","NAT_ROUND"]
["POLE_TYPE","Value","Pentachloraphenol (Pcp) Pole","PCP_POLE"]
["POLE_TYPE","Value","Pine Treated Pole","PINE_TREATED"]
["POLE_TYPE","Value","Square Sawn Customer Wood Pole","SQ_SAWN_CUST_WD"]
["POLE_TYPE","Value","Steel Pole","STEEL"]
["POLE_TYPE","Value","Wood Pole","WOOD"]
["QUANTITY_OF_PHASES","Header","Description","Code"]
["QUANTITY_OF_PHASES","Value","1 Phase","1_PHASE"]
["QUANTITY_OF_PHASES","Value","2 Phases","2_PHASE"]
["QUANTITY_OF_PHASES","Value","3 Phases","3_PHASE"]
["QUANTITY_OF_PHASES","Value","Swer","SWER"]
["QUANTITY_OF_PHASES","Value","Unknown","UNKNOWN"]
["REMEDIAL_TREATMENT","Header","Description","Code"]
["REMEDIAL_TREATMENT","Value","Ausplast","AUS"]
["REMEDIAL_TREATMENT","Value","Ausplast + Saver Rods","AUSSAV"]
["REMEDIAL_TREATMENT","Value","Nil Remedial Treatment","NONE_REM_TRT"]
["REMEDIAL_TREATMENT","Value","Other Treatment Type","OTHER"]
["REMEDIAL_TREATMENT","Value","Saver Rods","SAV"]
["RIVER_CROSSING_NAV","Header","Description","Code"]
["RIVER_CROSSING_NAV","Value","No","NO"]
["RIVER_CROSSING_NAV","Value","Yes","YES"]
["SAFETY_CHAIN","Header","Description","Code"]
["SAFETY_CHAIN","Value","No","NO"]
["SAFETY_CHAIN","Value","Yes","YES"]
["SL_CONTROL_TYPE","Header","Description","Code"]
["SL_CONTROL_TYPE","Value","PE Cell","PE_CELL"]
["SL_CONTROL_TYPE","Value","Streetlight Control Point","SLCP"]
["SL_HORIZ_SUPPORT","Header","Description","Code"]
["SL_HORIZ_SUPPORT","Value","Bracket - Major (>3M)","BRMA"]
["SL_HORIZ_SUPPORT","Value","Bracket - Minor (<3M)","BRMI"]
["SL_HORIZ_SUPPORT","Value","Legacy - Major Bracket (>3M)","LBRMA"]
["SL_HORIZ_SUPPORT","Value","Legacy - Minor Bracket (<3M)","LBRMI"]
["SL_HORIZ_SUPPORT","Value","Legacy - Major Outreach (>2M)","LOTMA"]
["SL_HORIZ_SUPPORT","Value","Legacy - Minor Outreach (<2M)","LOTMI"]
["SL_HORIZ_SUPPORT","Value","Legacy - Urd Min Outrch (>2M)","LUOTMI"]
["SL_HORIZ_SUPPORT","Value","Outreach (Al) - Major (>3M)","OTAMA"]
["SL_HORIZ_SUPPORT","Value","Outreach (Al) - Minor (<=3M)","OTAMI"]
["SL_HORIZ_SUPPORT","Value","Outreach - Major (>2M)","OTMA"]
["SL_HORIZ_SUPPORT","Value","Outreach - Minor (<2M)","OTMI"]
["SL_LUMINAIRE","Header","Description","Code"]
["SL_LUMINAIRE","Value","42W CFL - AEROSCREEN","CF42AS"]
["SL_LUMINAIRE","Value","42W CFL - BOURKE HILL","CF42BH"]
["SL_LUMINAIRE","Value","42W CFL - POST TOP","CF42PT"]
["SL_LUMINAIRE","Value","42W CFL - STANDARD","CF42ST"]
["SL_LUMINAIRE","Value","NIGHTWATCH MINOR (F42)","FF1A"]
["SL_LUMINAIRE","Value","NIGHTWATCH MINOR (F42) CT","FF1C"]
["SL_LUMINAIRE","Value","NIGHTWATCH MINOR (F2X14)","FF2A"]
["SL_LUMINAIRE","Value","NIGHTWATCH MINOR (F2X14) CT","FF2C"]
["SL_LUMINAIRE","Value","NIGHTWATCH SMALL (MH150)","FH1A"]
["SL_LUMINAIRE","Value","NIGHTWATCH MEDIUM (MH250)","FH2A"]
["SL_LUMINAIRE","Value","NIGHTWATCH LARGE (MH400)","FH3A"]
["SL_LUMINAIRE","Value","NIGHTWATCH X-LARGE (MH1000)","FH4A"]
["SL_LUMINAIRE","Value","NIGHTWATCH MINOR (L17)","FL1A"]
["SL_LUMINAIRE","Value","NIGHTWATCH MINOR (L18)","FL1B"]
["SL_LUMINAIRE","Value","NIGHTWATCH MINOR (L17) CT","FL1C"]
["SL_LUMINAIRE","Value","NIGHTWATCH SMALL (L75+)","FL2A"]
["SL_LUMINAIRE","Value","NIGHTWATCH MEDIUM (L100+)","FL3A"]
["SL_LUMINAIRE","Value","NIGHTWATCH MEDIUM (L150)","FL3B"]
["SL_LUMINAIRE","Value","NIGHTWATCH LARGE (L150+)","FL4A"]
["SL_LUMINAIRE","Value","NIGHTWATCH LARGE (L200)","FL4B"]
["SL_LUMINAIRE","Value","NIGHTWATCH X-LARGE (L300+)","FL5A"]
["SL_LUMINAIRE","Value","NIGHTWATCH MINOR (M80)","FM1A"]
["SL_LUMINAIRE","Value","NIGHTWATCH MINOR (M80) CT","FM1C"]
["SL_LUMINAIRE","Value","NIGHTWATCH SMALL (S150)","FS1A"]
["SL_LUMINAIRE","Value","NIGHTWATCH SMALL (S150) CT","FS1C"]
["SL_LUMINAIRE","Value","NIGHTWATCH MEDIUM (S250)","FS2A"]
["SL_LUMINAIRE","Value","NIGHTWATCH MEDIUM (S250) CT","FS2C"]
["SL_LUMINAIRE","Value","NIGHTWATCH LARGE (S400)","FS3A"]
["SL_LUMINAIRE","Value","NIGHTWATCH MINOR (S100)","FS4A"]
["SL_LUMINAIRE","Value","NIGHTWATCH MINOR (S70)","FS5A"]
["SL_LUMINAIRE","Value","NIGHTWATCH MINOR (S70) CT","FS5C"]
["SL_LUMINAIRE","Value","100W Sodium - AEROSCREEN","HP10AS"]
["SL_LUMINAIRE","Value","150W Sodium - FLOODLIGHT","HP15FL"]
["SL_LUMINAIRE","Value","250W Sodium - PARKVILLE","HP25PV"]
["SL_LUMINAIRE","Value","Subrbn 70W HPS c/w D2 PECB-STD","HP70ST"]
["SL_LUMINAIRE","Value","9W LED STREETLED Aeroscreen S-","L009SA"]
["SL_LUMINAIRE","Value","13W LED ATS PLED MKII","L013AP"]
["SL_LUMINAIRE","Value","13W LED STREETLED3 STD Visor S","L013SS"]
["SL_LUMINAIRE","Value","14W BOURKE HILL AVE 3K SIDE EN","L0143S"]
["SL_LUMINAIRE","Value","14W BOURKE HILL AVE 3K TOP ENT","L0143T"]
["SL_LUMINAIRE","Value","17W LED Post Top B2001 S-S","L017PS"]
["SL_LUMINAIRE","Value","17W LED B2001 NUWE Post Top","L017PT"]
["SL_LUMINAIRE","Value","17W LED STREETLED3 Aeroscreen","L017SA"]
["SL_LUMINAIRE","Value","17W LED P4","L017ST"]
["SL_LUMINAIRE","Value","18W LED Bourke Hill S-S","L018BH"]
["SL_LUMINAIRE","Value","18W LED P4 Gerard","L018ST"]
["SL_LUMINAIRE","Value","20W LED ATS PLED MKII","L020AP"]
["SL_LUMINAIRE","Value","24W LED Bourke Hill S-S","L024BH"]
["SL_LUMINAIRE","Value","24W LED STREETLED3 STD Visor S","L024SS"]
["SL_LUMINAIRE","Value","25W LED P4 Gerard","L025ST"]
["SL_LUMINAIRE","Value","28W LED Post Top B2001 S-S","L028PT"]
["SL_LUMINAIRE","Value","30W LED ATS PLED MKII","L030AP"]
["SL_LUMINAIRE","Value","33W LED P3 Gerard","L033SL"]
["SL_LUMINAIRE","Value","33W LED P4 Pecan","L033ST"]
["SL_LUMINAIRE","Value","36W LED 4K ROADLED MIDI Aerosc","L036RA"]
["SL_LUMINAIRE","Value","37W LED 4K ROADLED MIDI STD Vi","L037RM"]
["SL_LUMINAIRE","Value","39W LED 3K ROADLED MIDI Aerosc","L039RM"]
["SL_LUMINAIRE","Value","40W LED 3K ROADLED MIDI STD Vi","L040RM"]
["SL_LUMINAIRE","Value","42W LED P4 Gerard","L042ST"]
["SL_LUMINAIRE","Value","55W LED 4K ROADLED MIDI STD Vi","L055RM"]
["SL_LUMINAIRE","Value","57W LED 4K ROADLED MIDI Aerosc","L057RM"]
["SL_LUMINAIRE","Value","60W LED RoadLED Midi","L060LA"]
["SL_LUMINAIRE","Value","60W LED RoadLED Midi Opt Tuner","L060LO"]
["SL_LUMINAIRE","Value","61W LED 3K ROADLED MIDI STD Vi","L061RM"]
["SL_LUMINAIRE","Value","63W LED 3K ROADLED MIDI Aerosr","L063RM"]
["SL_LUMINAIRE","Value","70W LED RoadLED Midi","L070LA"]
["SL_LUMINAIRE","Value","74W LED ATS VLED","L074AV"]
["SL_LUMINAIRE","Value","75W LED Aglo Nilum Plus FldLgt","L075FL"]
["SL_LUMINAIRE","Value","80W BOURKE HILL 3K FTB","L080BH"]
["SL_LUMINAIRE","Value","80W LED RoadLED Midi Opt Tuner","L080LO"]
["SL_LUMINAIRE","Value","80W LED RoadLED Midi","L081LA"]
["SL_LUMINAIRE","Value","82W LED Gerard V5 Cat","L082ST"]
["SL_LUMINAIRE","Value","100W LED Aglo Nilum Plus FLDLT","L100FL"]
["SL_LUMINAIRE","Value","100W LED Gerard V4 Cat","L100ST"]
["SL_LUMINAIRE","Value","113W LED ROADLED MIDI STD Viso","L113RM"]
["SL_LUMINAIRE","Value","120W LED 4K ROADLED MIDI Aeros","L120RM"]
["SL_LUMINAIRE","Value","121W LED 3K ROADLED MIDI Aeros","L121RM"]
["SL_LUMINAIRE","Value","25W LED P4 GE","L125ST"]
["SL_LUMINAIRE","Value","150W LED 3K FLX ATS FLOODX","L1503F"]
["SL_LUMINAIRE","Value","150W LED 4K FLX ATS FLOODX","L1504F"]
["SL_LUMINAIRE","Value","150W LED Aglo Nilum Plus FLDLT","L150FL"]
["SL_LUMINAIRE","Value","150W LED SLED Maximus Pedstran","L150MP"]
["SL_LUMINAIRE","Value","150W PVILLE 3K FTB","L150P3"]
["SL_LUMINAIRE","Value","155W LED ATS VLED","L155AV"]
["SL_LUMINAIRE","Value","165W LED RoadLED Midi","L165LA"]
["SL_LUMINAIRE","Value","175W LED SLED Maximus Pedstran","L175MP"]
["SL_LUMINAIRE","Value","198W LED Gerard V2/V3 Cat","L198ST"]
["SL_LUMINAIRE","Value","205W LED 3K ROADLED MIDI Aeros","L205RM"]
["SL_LUMINAIRE","Value","230W LED Avento S-S","L230AS"]
["SL_LUMINAIRE","Value","250W LED 3K FLX ATS FLOODX","L2503F"]
["SL_LUMINAIRE","Value","250W LED 4K FLX ATS FLOODX","L2504F"]
["SL_LUMINAIRE","Value","254W LED 3K ROADLED MIDI STD V","L254RM"]
["SL_LUMINAIRE","Value","275W LED ROADLED S-S","L275RS"]
["SL_LUMINAIRE","Value","290W LED ATS VLED","L290AV"]
["SL_LUMINAIRE","Value","300W LED Aglo Nilum Plus FLOOD","L300LA"]
["SL_LUMINAIRE","Value","80W MF (LEGACY) A","LEG093"]
["SL_LUMINAIRE","Value","60W INC (LEGACY)","LEG1"]
["SL_LUMINAIRE","Value","2x250W MF 2 LANT (LEGACY)","LEG100"]
["SL_LUMINAIRE","Value","2x400W SHP 2 LANT (LEGACY)","LEG102"]
["SL_LUMINAIRE","Value","2x250W SHP (LEGACY)","LEG103"]
["SL_LUMINAIRE","Value","80W MF (LEGACY) B","LEG104"]
["SL_LUMINAIRE","Value","2x20W FL SIGN LIVERP. (LEGACY)","LEG112"]
["SL_LUMINAIRE","Value","250W MF F/L (LEGACY)","LEG114"]
["SL_LUMINAIRE","Value","400W MF F/L (LEGACY) A","LEG115"]
["SL_LUMINAIRE","Value","250W SHP F/L (LEGACY) A","LEG119"]
["SL_LUMINAIRE","Value","1500W INC F/L (LEGACY)","LEG12"]
["SL_LUMINAIRE","Value","400W MF P/T (LEGACY)","LEG121"]
["SL_LUMINAIRE","Value","400W MF F/L (LEGACY) B","LEG122"]
["SL_LUMINAIRE","Value","400W SHP F/L (LEGACY) A","LEG123"]
["SL_LUMINAIRE","Value","1000W QI F/L (LEGACY)","LEG129"]
["SL_LUMINAIRE","Value","20W FL (LEGACY)","LEG13"]
["SL_LUMINAIRE","Value","400W SHP F/L (LEGACY) B","LEG130"]
["SL_LUMINAIRE","Value","125W MF P/T (LEGACY)","LEG131"]
["SL_LUMINAIRE","Value","250W MF P/T (LEGACY)","LEG132"]
["SL_LUMINAIRE","Value","250W SHP F/L (LEGACY) B","LEG134"]
["SL_LUMINAIRE","Value","2x600W SHP 2 LANT (LEGACY)","LEG135"]
["SL_LUMINAIRE","Value","2x400W SHP (LEGACY) A","LEG136"]
["SL_LUMINAIRE","Value","2x20W FL (LEGACY) A","LEG14"]
["SL_LUMINAIRE","Value","250W SHP PED F/L (LEGACY) A","LEG140"]
["SL_LUMINAIRE","Value","250W SHP PED F/L (LEGACY) B","LEG141"]
["SL_LUMINAIRE","Value","150W SHP (LEGACY) A","LEG142"]
["SL_LUMINAIRE","Value","150W SHP (LEGACY) B","LEG143"]
["SL_LUMINAIRE","Value","100W INC  PEDX (LEGACY)","LEG144"]
["SL_LUMINAIRE","Value","4x600W SHP 7HILLS (LEGACY)","LEG145"]
["SL_LUMINAIRE","Value","2x310 SHP P/T (LEGACY)","LEG146"]
["SL_LUMINAIRE","Value","80W MF P/T URD (LEGACY)","LEG147"]
["SL_LUMINAIRE","Value","80W MF P/T (LEGACY)","LEG149"]
["SL_LUMINAIRE","Value","3x20W FL (LEGACY)","LEG15"]
["SL_LUMINAIRE","Value","120W SHP (LEGACY) A","LEG150"]
["SL_LUMINAIRE","Value","3x400W SHP 3 LANT (LEGACY)","LEG151"]
["SL_LUMINAIRE","Value","4x400W SHP 2 LANT (LEGACY)","LEG152"]
["SL_LUMINAIRE","Value","3x400W SHP 2 LANT (LEGACY)","LEG153"]
["SL_LUMINAIRE","Value","250W SHP P/T (LEGACY)","LEG154"]
["SL_LUMINAIRE","Value","120W SHP F/L (LEGACY)","LEG157"]
["SL_LUMINAIRE","Value","125W MF F/L (LEGACY)","LEG158"]
["SL_LUMINAIRE","Value","2x400W SHP (LEGACY) B","LEG159"]
["SL_LUMINAIRE","Value","120W SHP (LEGACY) B","LEG162"]
["SL_LUMINAIRE","Value","100W SHP (LEGACY) A","LEG167"]
["SL_LUMINAIRE","Value","100W SHP P/T (LEGACY)","LEG168"]
["SL_LUMINAIRE","Value","100W SHP (LEGACY) B","LEG169"]
["SL_LUMINAIRE","Value","150W SHP F/L (LEGACY) A","LEG170"]
["SL_LUMINAIRE","Value","150W SHP F/L (LEGACY) B","LEG171"]
["SL_LUMINAIRE","Value","150W SHP P/T (LEGACY)","LEG173"]
["SL_LUMINAIRE","Value","50W MF (LEGACY) A","LEG177"]
["SL_LUMINAIRE","Value","700W MF (LEGACY)","LEG178"]
["SL_LUMINAIRE","Value","40W FL (LEGACY) A","LEG18"]
["SL_LUMINAIRE","Value","50W SHP (LEGACY)","LEG182"]
["SL_LUMINAIRE","Value","70W SHP (LEGACY) A","LEG183"]
["SL_LUMINAIRE","Value","70W SHP (LEGACY) B","LEG184"]
["SL_LUMINAIRE","Value","50W MF (LEGACY) B","LEG185"]
["SL_LUMINAIRE","Value","80W MF URD (LEGACY)","LEG186"]
["SL_LUMINAIRE","Value","80W MF URD PRESTIGE (LEGACY)","LEG187"]
["SL_LUMINAIRE","Value","80W MF PRESTIGE (LEGACY)","LEG188"]
["SL_LUMINAIRE","Value","2x40W FL (LEGACY)","LEG19"]
["SL_LUMINAIRE","Value","400W SHP P/T (LEGACY)","LEG190"]
["SL_LUMINAIRE","Value","150W SDL MACQUARIE (LEGACY)","LEG193"]
["SL_LUMINAIRE","Value","150W SDL LIVERP. CBD (LEGACY)","LEG194"]
["SL_LUMINAIRE","Value","2x18W FL DOWNL. (LEGACY)","LEG195"]
["SL_LUMINAIRE","Value","1000W MH (LEGACY)","LEG196"]
["SL_LUMINAIRE","Value","400W MH (LEGACY) A","LEG197"]
["SL_LUMINAIRE","Value","250W MH (LEGACY) A","LEG198"]
["SL_LUMINAIRE","Value","150W MH (LEGACY) A","LEG199"]
["SL_LUMINAIRE","Value","400W MH (LEGACY) B","LEG211"]
["SL_LUMINAIRE","Value","2 x 400W MH (LEGACY)","LEG212"]
["SL_LUMINAIRE","Value","250W MH (LEGACY) B","LEG213"]
["SL_LUMINAIRE","Value","2 x 250W MH (LEGACY)","LEG214"]
["SL_LUMINAIRE","Value","150W MH (LEGACY) B","LEG215"]
["SL_LUMINAIRE","Value","100W MH (LEGACY) A","LEG216"]
["SL_LUMINAIRE","Value","100W MH (LEGACY) B","LEG217"]
["SL_LUMINAIRE","Value","2x14W (LEGACY)","LEG218"]
["SL_LUMINAIRE","Value","2x24W (LEGACY)","LEG219"]
["SL_LUMINAIRE","Value","2x14W FL (LEGACY)","LEG220"]
["SL_LUMINAIRE","Value","2x24W FL (LEGACY)","LEG221"]
["SL_LUMINAIRE","Value","42W CFL (LEGACY) A","LEG222"]
["SL_LUMINAIRE","Value","42W CFL (LEGACY) B","LEG223"]
["SL_LUMINAIRE","Value","400W SHP PED F/L (LEGACY) A","LEG25"]
["SL_LUMINAIRE","Value","100W INC (LEGACY)","LEG3"]
["SL_LUMINAIRE","Value","250W MF (LEGACY) A","LEG30"]
["SL_LUMINAIRE","Value","20W FL GIFTED (LEGACY)","LEG302"]
["SL_LUMINAIRE","Value","40W FL GIFTED (LEGACY)","LEG303"]
["SL_LUMINAIRE","Value","40WFL GIFTED (LEGACY)","LEG305"]
["SL_LUMINAIRE","Value","2x40W FL GIFTED (LEGACY)","LEG306"]
["SL_LUMINAIRE","Value","50W MF GIFTED (LEGACY) A","LEG307"]
["SL_LUMINAIRE","Value","50W MF GIFTED (LEGACY) B","LEG308"]
["SL_LUMINAIRE","Value","80W MF GIFTED (LEGACY) A","LEG309"]
["SL_LUMINAIRE","Value","400W MF (LEGACY) A","LEG31"]
["SL_LUMINAIRE","Value","80W MF PREST GIFTED (LEGACY)","LEG310"]
["SL_LUMINAIRE","Value","80W MF P/T GIFTED (LEGACY)","LEG311"]
["SL_LUMINAIRE","Value","80W MF P/T URD GIFTED (LEGACY)","LEG312"]
["SL_LUMINAIRE","Value","80W MF URD GIFTED (LEGACY)","LEG313"]
["SL_LUMINAIRE","Value","80W MF URD PREST GIFTED (LGCY)","LEG314"]
["SL_LUMINAIRE","Value","80W MF GIFTED (LEGACY) B","LEG315"]
["SL_LUMINAIRE","Value","125W MF GIFTED (LEGACY) A","LEG316"]
["SL_LUMINAIRE","Value","125W MF P/T GIFTED (LEGACY)","LEG317"]
["SL_LUMINAIRE","Value","125W MF GIFTED (LEGACY) B","LEG318"]
["SL_LUMINAIRE","Value","250W MF GIFTED (LEGACY) A","LEG320"]
["SL_LUMINAIRE","Value","250W MF GIFTED (LEGACY) B","LEG323"]
["SL_LUMINAIRE","Value","400W MF GIFTED (LEGACY) A","LEG326"]
["SL_LUMINAIRE","Value","400W MF GIFTED (LEGACY) B","LEG329"]
["SL_LUMINAIRE","Value","55W SLP (LEGACY)","LEG33"]
["SL_LUMINAIRE","Value","400W MF F/L GIFTED (LEGACY)","LEG330"]
["SL_LUMINAIRE","Value","70W HPS P/T GIFTED (LEGACY)","LEG332"]
["SL_LUMINAIRE","Value","50W SHP GIFTED (LEGACY)","LEG335"]
["SL_LUMINAIRE","Value","70W SHP GIFTED (LEGACY) A","LEG336"]
["SL_LUMINAIRE","Value","70W SHP GIFTED (LEGACY) B","LEG337"]
["SL_LUMINAIRE","Value","150W SHP GIFTED (LEGACY) A","LEG338"]
["SL_LUMINAIRE","Value","150W SHP F/L GIFTED (LEGACY)","LEG339"]
["SL_LUMINAIRE","Value","90W SLP (LEGACY)","LEG34"]
["SL_LUMINAIRE","Value","150W SHP P/T GIFTED (LEGACY)","LEG340"]
["SL_LUMINAIRE","Value","150W SHP GIFTED (LEGACY) B","LEG341"]
["SL_LUMINAIRE","Value","250W SHP GIFTED (LEGACY) A","LEG343"]
["SL_LUMINAIRE","Value","250W SHP F/L GIFTED (LEGACY) A","LEG344"]
["SL_LUMINAIRE","Value","250W SHP F/L GIFTED (LEGACY) B","LEG345"]
["SL_LUMINAIRE","Value","250W SHP P/T GIFTED (LEGACY)","LEG346"]
["SL_LUMINAIRE","Value","250W SHP GIFTED (LEGACY) B","LEG347"]
["SL_LUMINAIRE","Value","250W SHP F/L GIFTED (LEGACY) C","LEG348"]
["SL_LUMINAIRE","Value","250W SHP F/L GIFTED (LEGACY) D","LEG349"]
["SL_LUMINAIRE","Value","135W SLP (LEGACY)","LEG35"]
["SL_LUMINAIRE","Value","2x250W SHP GIFTED (LEGACY)","LEG350"]
["SL_LUMINAIRE","Value","400W SHP GIFTED (LEGACY) A","LEG352"]
["SL_LUMINAIRE","Value","400W SHP F/L GIFTED (LEGACY) A","LEG353"]
["SL_LUMINAIRE","Value","400W SHP F/L GIFTED (LEGACY) B","LEG354"]
["SL_LUMINAIRE","Value","400W SHP GIFTED (LEGACY) B","LEG355"]
["SL_LUMINAIRE","Value","400W SHP F/L GIFTED (LEGACY) C","LEG356"]
["SL_LUMINAIRE","Value","400W SHP F/L GIFTED (LEGACY) D","LEG357"]
["SL_LUMINAIRE","Value","2x400W SHP GIFTED (LEGACY) A","LEG358"]
["SL_LUMINAIRE","Value","2x400W SHP GIFTED (LEGACY) B","LEG360"]
["SL_LUMINAIRE","Value","2x400W SHP GIFTED (LEGACY) C","LEG361"]
["SL_LUMINAIRE","Value","150W MH GIFTED (LEGACY) A","LEG365"]
["SL_LUMINAIRE","Value","250W MH GIFTED (LEGACY) A","LEG366"]
["SL_LUMINAIRE","Value","250W SHP (LEGACY) A","LEG38"]
["SL_LUMINAIRE","Value","100W SHP GIFTED (LEGACY) A","LEG380"]
["SL_LUMINAIRE","Value","100W SHP GIFTED (LEGACY) B","LEG381"]
["SL_LUMINAIRE","Value","310W SHP (LEGACY) A","LEG39"]
["SL_LUMINAIRE","Value","TRAFFIC FLASH GIFTED (LEGACY)","LEG395"]
["SL_LUMINAIRE","Value","400W MH GIFTED (LEGACY) A","LEG396"]
["SL_LUMINAIRE","Value","1000W MH GIFTED (LEGACY)","LEG397"]
["SL_LUMINAIRE","Value","IDENTILITE GIFTED (LEGACY)","LEG398"]
["SL_LUMINAIRE","Value","400W SHP (LEGACY) A","LEG40"]
["SL_LUMINAIRE","Value","150W MH Parra GIFTED (LEGACY)","LEG400"]
["SL_LUMINAIRE","Value","125W MF Parra GIFTED (LEGACY)","LEG401"]
["SL_LUMINAIRE","Value","250W MH GIFTED (LEGACY) B","LEG402"]
["SL_LUMINAIRE","Value","2 x 250W MH GIFTED (LEGACY)","LEG403"]
["SL_LUMINAIRE","Value","400W MH GIFTED (LEGACY) B","LEG404"]
["SL_LUMINAIRE","Value","2 x 400W MH GIFTED (LEGACY)","LEG405"]
["SL_LUMINAIRE","Value","150W MH GIFTED (LEGACY) B","LEG410"]
["SL_LUMINAIRE","Value","100W MH GIFTED (LEGACY) A","LEG411"]
["SL_LUMINAIRE","Value","100W MH GIFTED (LEGACY) B","LEG412"]
["SL_LUMINAIRE","Value","2x14W FL GIFTED (LEGACY)","LEG413"]
["SL_LUMINAIRE","Value","2x24W FL GIFTED (LEGACY)","LEG414"]
["SL_LUMINAIRE","Value","2x14W GIFTED (LEGACY)","LEG415"]
["SL_LUMINAIRE","Value","2x24W GIFTED (LEGACY)","LEG416"]
["SL_LUMINAIRE","Value","42W CFL GIFTED (LEGACY)","LEG421"]
["SL_LUMINAIRE","Value","4x600W SHP (LEGACY)","LEG43"]
["SL_LUMINAIRE","Value","400W SHP PED F/L (LEGACY) B","LEG45"]
["SL_LUMINAIRE","Value","250W MF (LEGACY) B","LEG49"]
["SL_LUMINAIRE","Value","250W SHP (LEGACY) B","LEG55"]
["SL_LUMINAIRE","Value","310W SHP (LEGACY) B","LEG56"]
["SL_LUMINAIRE","Value","400W SHP (LEGACY) B","LEG57"]
["SL_LUMINAIRE","Value","40W FL URD (LEGACY)","LEG63"]
["SL_LUMINAIRE","Value","2x20W FL (LEGACY) B","LEG68"]
["SL_LUMINAIRE","Value","4x20W FL (LEGACY)","LEG69"]
["SL_LUMINAIRE","Value","40W FL (LEGACY) B","LEG70"]
["SL_LUMINAIRE","Value","4x40W FL SIGN CAB (LEGACY)","LEG75"]
["SL_LUMINAIRE","Value","150W INC F/L (LEGACY)","LEG8"]
["SL_LUMINAIRE","Value","2x40W FL MILPERRA BG. (LEGACY)","LEG85"]
["SL_LUMINAIRE","Value","4x600W SHP V/WOOD (LEGACY)","LEG88"]
["SL_LUMINAIRE","Value","80W MF (LEGACY) C","LEG93"]
["SL_LUMINAIRE","Value","125W MF (LEGACY) A","LEG94"]
["SL_LUMINAIRE","Value","250W MF (LEGACY) C","LEG95"]
["SL_LUMINAIRE","Value","400W MF (LEGACY) B","LEG96"]
["SL_LUMINAIRE","Value","125W MF (LEGACY) B","LEG97"]
["SL_LUMINAIRE","Value","250W MF (LEGACY) D","LEG98"]
["SL_LUMINAIRE","Value","400W MF (LEGACY) C","LEG99"]
["SL_LUMINAIRE","Value","50W Mercury - STANDARD","M50ST"]
["SL_LUMINAIRE","Value","80W Mercury - AEROSCREEN","M80AS"]
["SL_LUMINAIRE","Value","80W Mercury - POST TOP","M80PT"]
["SL_LUMINAIRE","Value","80W Mercury - STANDARD","M80ST"]
["SL_LUMINAIRE","Value","100W Metal Halide - STANDARD","MH10ST"]
["SL_LUMINAIRE","Value","150W Metal Halide - AEROSCREEN","MH15AS"]
["SL_LUMINAIRE","Value","150W Metal Halide - FLOODLIGHT","MH15FL"]
["SL_LUMINAIRE","Value","150W Metal Halide - STANDARD","MH15ST"]
["SL_LUMINAIRE","Value","250W Metal Halide - AEROSCREEN","MH25AS"]
["SL_LUMINAIRE","Value","250W Metal Halide - FLOODLIGHT","MH25FL"]
["SL_LUMINAIRE","Value","250W Metal Halide - STANDARD","MH25ST"]
["SL_LUMINAIRE","Value","400W Metal Halide - AEROSCREEN","MH40AS"]
["SL_LUMINAIRE","Value","400W Metal Halide - FLOODLIGHT","MH40FL"]
["SL_LUMINAIRE","Value","RTA Fluorescent 18W","R250"]
["SL_LUMINAIRE","Value","RTA Fluorescent 20W","R251"]
["SL_LUMINAIRE","Value","RTA High Pressure Sodium 100W","R252"]
["SL_LUMINAIRE","Value","RTA High Pressure Sodium 150W","R253"]
["SL_LUMINAIRE","Value","RTA High Pressure Sodium 250W","R254"]
["SL_LUMINAIRE","Value","RTA High Pressure Sodium 400W","R255"]
["SL_LUMINAIRE","Value","RTA LED 17W","R256"]
["SL_LUMINAIRE","Value","RTA LED 85W 4000K","R257"]
["SL_LUMINAIRE","Value","RTA LED 175W 4000K","R258"]
["SL_LUMINAIRE","Value","RTA LED 198W 4000K","R259"]
["SL_LUMINAIRE","Value","RTA LED 200W 4000K","R260"]
["SL_LUMINAIRE","Value","RTA LED 265W 4000K","R261"]
["SL_LUMINAIRE","Value","RTA LED 275W 4000K","R262"]
["SL_LUMINAIRE","Value","RTA LED 198W 4000K (259)","RLD198"]
["SL_LUMINAIRE","Value","100W Sodium - STANDARD","S100ST"]
["SL_LUMINAIRE","Value","150W Sodium - AEROSCREEN","S150AS"]
["SL_LUMINAIRE","Value","150W Sodium - STANDARD","S150ST"]
["SL_LUMINAIRE","Value","250W Sodium - AEROSCREEN","S250AS"]
["SL_LUMINAIRE","Value","250W Sodium - FLOODLIGHT","S250FL"]
["SL_LUMINAIRE","Value","250W Sodium - STANDARD","S250ST"]
["SL_LUMINAIRE","Value","400W Sodium - AEROSCREEN","S400AS"]
["SL_LUMINAIRE","Value","400W Sodium - FLOODLIGHT","S400FL"]
["SL_LUMINAIRE","Value","400W Sodium - STANDARD","S400ST"]
["SL_LUMINAIRE","Value","70W Sodium - STANDARD","S70ST"]
["SL_LUMINAIRE","Value","2x14W T5 FL - STANDARD","T514ST"]
["SL_LUMINAIRE","Value","2x24W T5 FL - STANDARD","T524ST"]
["SL_TARIFF_CLASS","Header","Description","Code"]
["SL_TARIFF_CLASS","Value","(1) Legacy, Constructed by EE","1"]
["SL_TARIFF_CLASS","Value","(2) Legacy, Gift by Customer","2"]
["SL_TARIFF_CLASS","Value","(3) Annuity, Constructed by EE","3"]
["SL_TARIFF_CLASS","Value","(4) Annuity, Gift by Customer","4"]
["SL_TARIFF_CLASS","Value","(6) Owned by Customer","6"]
["SL_VERT_SUPPORT","Header","Description","Code"]
["SL_VERT_SUPPORT","Value","Column (Al) - Major (>9M)","CAMA"]
["SL_VERT_SUPPORT","Value","Column (Al) - Minor (<=9M)","CAMI"]
["SL_VERT_SUPPORT","Value","Column (Steel) - Major (>9M)","CSMA"]
["SL_VERT_SUPPORT","Value","Column (Steel) - Minor (<9M)","CSMI"]
["SL_VERT_SUPPORT","Value","Legacy - Major Column (>9M)","LCSMA"]
["SL_VERT_SUPPORT","Value","Legacy - Minor Column (<9M)","LCSMI"]
["SL_VERT_SUPPORT","Value","Legacy - Urd Min Column (<9M)","LUCSMI"]
["SL_VERT_SUPPORT","Value","Legacy - Maj Wood Pole (>11M)","LWPMA"]
["SL_VERT_SUPPORT","Value","Legacy - Min Wood Pole (<11M)","LWPMI"]
["SL_VERT_SUPPORT","Value","Pole (Wd) - Major (>11M)","PWMA"]
["SL_VERT_SUPPORT","Value","Pole (Wd) - Maj-Ded Sl (>11M)","PWMAD"]
["SL_VERT_SUPPORT","Value","Pole (Wd) - Minor (<11M)","PWMI"]
["SL_VERT_SUPPORT","Value","Pole (Wd) - Min-Ded Sl (<11M)","PWMID"]
["SPECIAL_USE_CODE","Header","Description","Code"]
["SPECIAL_USE_CODE","Value","Only EE Assets + Tx on Pole","A"]
["SPECIAL_USE_CODE","Value","Telstra Joint Use + Tx on Pole","B"]
["SPECIAL_USE_CODE","Value","Telstra Commn Use + Tx on Pole","C"]
["SPECIAL_USE_CODE","Value","Extndd Service Line/Cust Owned","D"]
["SPECIAL_USE_CODE","Value","Telstra Common Use","E"]
["SPECIAL_USE_CODE","Value","Extend Service Line/ex Nepean","F"]
["SPECIAL_USE_CODE","Value","Common Use/Telstra owned","G"]
["SPECIAL_USE_CODE","Value","Priv Tx Line/Cust ownd + Tx PL","H"]
["SPECIAL_USE_CODE","Value","Telstra Joint Use","J"]
["SPECIAL_USE_CODE","Value","Ausgrid Mains on Pole","K"]
["SPECIAL_USE_CODE","Value","EE Mains on Pole/SRA owned","L"]
["SPECIAL_USE_CODE","Value","EE Mns PL/Trsgrd Owd + Tx Pole","M"]
["SPECIAL_USE_CODE","Value","EE Mains on Pole/Ausgrid Owned","N"]
["SPECIAL_USE_CODE","Value","Private HV Line/Customer owned","P"]
["SPECIAL_USE_CODE","Value","Priv HV Mns/EE ownd + Tx  Pole","R"]
["SPECIAL_USE_CODE","Value","Stay Pole","S"]
["SPECIAL_USE_CODE","Value","Optus owned pole","T"]
["SPECIAL_USE_CODE","Value","EE Mns Pole/Asgrd Ownd + Tx PL","W"]
["SPECIAL_USE_CODE","Value","Fire Station","X"]
["SPECIAL_USE_CODE","Value","Only EE Assets on Pole","Z"]
["SPREADER_TYPE","Header","Description","Code"]
["SPREADER_TYPE","Value","Overhead Spreader 2.0M Long","2.0M_LONG_SP"]
["SPREADER_TYPE","Value","Overhead Spreader 2.8M Long","2.8M_LONG_SP"]
["STATE_HERITAGE_REGISTER","Header","Description","Code"]
["STATE_HERITAGE_REGISTER","Value","No","NO"]
["STATE_HERITAGE_REGISTER","Value","Yes","YES"]
["SUB_ENCLOSURE","Header","Description","Code"]
["SUB_ENCLOSURE","Value","Aluminium","ALUMINIUM"]
["SUB_ENCLOSURE","Value","Brick Substation Enclosure","BRICK"]
["SUB_ENCLOSURE","Value","Brick/Concrete Sub Enclosure","BRICK_CONCRETE"]
["SUB_ENCLOSURE","Value","Column","COL"]
["SUB_ENCLOSURE","Value","Fence Only","FEN"]
["SUB_ENCLOSURE","Value","Fibro","FIB"]
["SUB_ENCLOSURE","Value","Fibreglass","FIBREGLASS"]
["SUB_ENCLOSURE","Value","No Substation Enclosure Type","NOT_APPLICABLE"]
["SUB_ENCLOSURE","Value","Plastic","PLASTIC"]
["SUB_ENCLOSURE","Value","Pole","POLE"]
["SUB_ENCLOSURE","Value","Steel","STEEL"]
["SUB_ENCLOSURE","Value","Unknown","UNKNOWN"]
["SUB_FOOTING","Header","Description","Code"]
["SUB_FOOTING","Value","Brick/Concrete Footing","BRICK_CONCRETE"]
["SUB_FOOTING","Value","Culvert","CULVERT"]
["SUB_FOOTING","Value","Direct On Ground","DIRECT_ON_GROUND"]
["SUB_FOOTING","Value","Kiosk (Bathtub)","KIOSK_(BATHTUB)"]
["SUB_FOOTING","Value","Pole","POLE"]
["SUB_FOOTING","Value","Poured Pier","POURED_PIER"]
["SUB_FOOTING","Value","Unknown","UNKNOWN"]
["SURGE_DIVERTER_LOCATION","Header","Description","Code"]
["SURGE_DIVERTER_LOCATION","Value","Xarm Mounted Surge Diverter","CROSSARM"]
["SURGE_DIVERTER_LOCATION","Value","Transf Mounted Surge Diverter","TRANSFORMER"]
["SURGE_DIVERTER_TYPE","Header","Description","Code"]
["SURGE_DIVERTER_TYPE","Value","Polymeric Type Surge Diverter","POLYMERIC"]
["SURGE_DIVERTER_TYPE","Value","Porcelain Type Surge Diverter","PORCELAIN"]
["SURGE_DIVERTER_VENTED","Header","Description","Code"]
["SURGE_DIVERTER_VENTED","Value","Surge Diverter Is Not Vented","NOT_VENTED"]
["SURGE_DIVERTER_VENTED","Value","Surge Diverter Is Vented","VENTED"]
["SURGE_DIV_FITMENT","Header","Description","Code"]
["SURGE_DIV_FITMENT","Value","Above Fuses","ABOVE_FUSES"]
["SURGE_DIV_FITMENT","Value","On Tank","ON_TANK"]
["SURGE_DIV_FITMENT","Value","Unknown","UNKNOWN"]
["SWITCHGEAR_CONFIG","Header","Description","Code"]
["SWITCHGEAR_CONFIG","Value","Aa","AA"]
["SWITCHGEAR_CONFIG","Value","Aaa","AAA"]
["SWITCHGEAR_CONFIG","Value","Aaaa","AAAA"]
["SWITCHGEAR_CONFIG","Value","Aaaaa","AAAAA"]
["SWITCHGEAR_CONFIG","Value","Aaaabc","AAAABC"]
["SWITCHGEAR_CONFIG","Value","Aaaabcbc","AAAABCBC"]
["SWITCHGEAR_CONFIG","Value","Aaabc","AAABC"]
["SWITCHGEAR_CONFIG","Value","Aabaa","AABAA"]
["SWITCHGEAR_CONFIG","Value","Aabc","AABC"]
["SWITCHGEAR_CONFIG","Value","Aabca","AABCA"]
["SWITCHGEAR_CONFIG","Value","Aabcbca","AABCBCA"]
["SWITCHGEAR_CONFIG","Value","Aabcbcaaa","AABCBCAAA"]
["SWITCHGEAR_CONFIG","Value","Aabcbcabcaa","AABCBCABCAA"]
["SWITCHGEAR_CONFIG","Value","Aac","AAC"]
["SWITCHGEAR_CONFIG","Value","Aaea","AAEA"]
["SWITCHGEAR_CONFIG","Value","Aaeaa","AAEAA"]
["SWITCHGEAR_CONFIG","Value","Aasa","AASA"]
["SWITCHGEAR_CONFIG","Value","Aasaa","AASAA"]
["SWITCHGEAR_CONFIG","Value","Abac","ABAC"]
["SWITCHGEAR_CONFIG","Value","Abc","ABC"]
["SWITCHGEAR_CONFIG","Value","Abca","ABCA"]
["SWITCHGEAR_CONFIG","Value","Abcbca","ABCBCA"]
["SWITCHGEAR_CONFIG","Value","Ac","AC"]
["SWITCHGEAR_CONFIG","Value","Ace","ACE"]
["SWITCHGEAR_CONFIG","Value","Aeaas","AEAAS"]
["SWITCHGEAR_CONFIG","Value","Bcaaa","BCAAA"]
["SWITCHGEAR_CONFIG","Value","Bcaabc","BCAABC"]
["SWITCHGEAR_CONFIG","Value","Bcabc","BCABC"]
["SWITCHGEAR_CONFIG","Value","Bcabca","BCABCA"]
["SWITCHGEAR_CONFIG","Value","Bcbca","BCBCA"]
["SWITCHGEAR_CONFIG","Value","Bcbcaa","BCBCAA"]
["SWITCHGEAR_CONFIG","Value","Bcbcaaa","BCBCAAA"]
["SWITCHGEAR_CONFIG","Value","Cba","CBA"]
["SWITCHGEAR_CONFIG","Value","Ccc","CCC"]
["SWITCHGEAR_CONFIG","Value","Cccc","CCCC"]
["SWITCHGEAR_CONFIG","Value","Cf","CF"]
["SWITCHGEAR_CONFIG","Value","Cfc","CFC"]
["SWITCHGEAR_CONFIG","Value","Cfcc","CFCC"]
["SWITCHGEAR_CONFIG","Value","Direct Connected","DIRECT_CONNECTED"]
["SWITCHGEAR_CONFIG","Value","Dof","DOF"]
["SWITCHGEAR_CONFIG","Value","Eaabca","EAABCA"]
["SWITCHGEAR_CONFIG","Value","Fc","FC"]
["SWITCHGEAR_CONFIG","Value","Saabca","SAABCA"]
["SWITCHGEAR_CONFIG","Value","Saaeaa","SAAEAA"]
["SWITCHGEAR_CONFIG","Value","Sc","SC"]
["SWITCHGEAR_CONFIG","Value","Scs","SCS"]
["SWITCHGEAR_CONFIG","Value","Scss","SCSS"]
["SWITCHGEAR_CONFIG","Value","Sf","SF"]
["SWITCHGEAR_CONFIG","Value","Sfs","SFS"]
["SWITCHGEAR_CONFIG","Value","Sfss","SFSS"]
["SWITCHGEAR_CONFIG","Value","Sss","SSS"]
["SWITCHGEAR_CONFIG","Value","Ssss","SSSS"]
["SWITCHGEAR_CONFIG","Value","Unknown","UNKNOWN"]
["TANK_SURFACE","Header","Description","Code"]
["TANK_SURFACE","Value","Emer - Tan","A"]
["TANK_SURFACE","Value","Delv - Elec","B"]
["TANK_SURFACE","Value","Bituminous Coated Steel","BITCTDSTL"]
["TANK_SURFACE","Value","Emer - Gard","C"]
["TANK_SURFACE","Value","Delux Acrylic Ferrador","D"]
["TANK_SURFACE","Value","Galvaclad","E"]
["TANK_SURFACE","Value","Enamel Finish","F"]
["TANK_SURFACE","Value","Enamel","G"]
["TANK_SURFACE","Value","Galvanised Steel","K"]
["TANK_SURFACE","Value","Anodised Aluminium","L"]
["TANK_SURFACE","Value","Sheridised Aluminium","M"]
["TANK_SURFACE","Value","Hoxton Park - 2 Pack Poly","P"]
["TANK_SURFACE","Value","Stainless Steel","S"]
["TANK_SURFACE","Value","Tyree - Powdercoat","T"]
["TANK_SURFACE","Value","Wilson - Powdercoat","W"]
["TANK_SURFACE","Value","Painted - Unknown Finish","Z"]
["TAP_CURRENT","Header","Description","Code"]
["TAP_CURRENT","Value","1","1"]
["TAP_CURRENT","Value","2","2"]
["TAP_CURRENT","Value","3","3"]
["TAP_CURRENT","Value","4","4"]
["TAP_CURRENT","Value","5","5"]
["TAP_CURRENT","Value","6","6"]
["TAP_CURRENT","Value","7","7"]
["TAP_CURRENT","Value","8","8"]
["TAP_CURRENT","Value","9","9"]
["TAP_CURRENT","Value","10","10"]
["TAP_GROUP","Header","Description","Code"]
["TAP_GROUP","Value","1","1"]
["TAP_GROUP","Value","2","2"]
["TAP_GROUP","Value","3","3"]
["TAP_GROUP","Value","4","4"]
["TAP_GROUP","Value","5","5"]
["TAP_GROUP","Value","6","6"]
["TAP_GROUP","Value","7","7"]
["TAP_GROUP","Value","8","8"]
["TAP_GROUP","Value","9","9"]
["TAP_GROUP","Value","10","10"]
["TAP_GROUP","Value","11","11"]
["TAP_GROUP","Value","12","12"]
["TAP_GROUP","Value","13","13"]
["TAP_GROUP","Value","14","14"]
["TAP_GROUP","Value","15","15"]
["TAP_GROUP","Value","16","16"]
["TAP_GROUP","Value","17","17"]
["TAP_GROUP","Value","18","18"]
["TAP_GROUP","Value","22","22"]
["TAP_GROUP","Value","23","23"]
["TAP_GROUP","Value","25","25"]
["TAP_GROUP","Value","50","50"]
["TFR_HV_CONNECT_TYPE","Header","Description","Code"]
["TFR_HV_CONNECT_TYPE","Value","Epoxy Connection","EPOXYCONN"]
["TFR_HV_CONNECT_TYPE","Value","Plug","PLUG"]
["TFR_LOAD_TYPE","Header","Description","Code"]
["TFR_LOAD_TYPE","Value","Additional Load","ADDITIONAL_LOAD"]
["TFR_LOAD_TYPE","Value","Interference Load Type","INTERFERENCE_LOAD"]
["TFR_LOAD_TYPE","Value","Normal Load Type","NORMAL_LOAD"]
["TFR_LOAD_TYPE","Value","Unknown","UNKNOWN"]
["TRANSUGOH","Header","Description","Code"]
["TRANSUGOH","Value","No","NO"]
["TRANSUGOH","Value","Yes","YES"]
["T_VALUE","Header","Description","Code"]
["T_VALUE","Value","0","0"]
["T_VALUE","Value","2","2"]
["T_VALUE","Value","4","4"]
["T_VALUE","Value","A","A"]
["T_VALUE","Value","B","B"]
["T_VALUE","Value","C","C"]
["UG_JOINT_TYPE","Header","Description","Code"]
["UG_JOINT_TYPE","Value","End Cap","END_CAP"]
["UG_JOINT_TYPE","Value","Mains Joint","MAINS_JOINT"]
["UG_JOINT_TYPE","Value","Parallel Branch Joint","PARALLEL_BRANCH JOINT"]
["UG_JOINT_TYPE","Value","Screened Elbow Joint","SCREENED_ELBOW_JOINT"]
["UG_JOINT_TYPE","Value","Straight Through Joint","STRAIGHT_THROUGH_JOINT"]
["UG_JOINT_TYPE","Value","Tee Joint","TEE_JOINT"]
["UG_JOINT_TYPE","Value","Transition Through Joint","TRANSITION_THROUGH_JOINT"]
["UG_JOINT_TYPE","Value","Unknown","UNKNOWN"]
["UNMETERED_SUPPLY","Header","Description","Code"]
["UNMETERED_SUPPLY","Value","No","NO"]
["UNMETERED_SUPPLY","Value","Yes","YES"]
["URBAN","Header","Description","Code"]
["URBAN","Value","No","NO"]
["URBAN","Value","Yes","YES"]
["VECTOR_GROUP","Header","Description","Code"]
["VECTOR_GROUP","Value","31DY1","31DY1"]
["VECTOR_GROUP","Value","41DY11","41DY11"]
["VECTOR_GROUP","Value","Dy1","DY1"]
["VECTOR_GROUP","Value","Dy11","DY11"]
["VECTOR_GROUP","Value","DYN1","DYN1"]
["VECTOR_GROUP","Value","Dyn11","DYN11"]
["VECTOR_GROUP","Value","Dz0","DZ0"]
["VECTOR_GROUP","Value","Single Phase","SINGLE_PHASE"]
["VECTOR_GROUP","Value","SWER","SWER"]
["VECTOR_GROUP","Value","Y02","Y01"]
["VECTOR_GROUP","Value","Yd1","YD1"]
["VECTOR_GROUP","Value","Yna0D1","YNA0D1"]
["VECTOR_GROUP","Value","YNA0D11","YNA0D11"]
["VECTOR_GROUP","Value","YND1","YND1"]
["VECTOR_GROUP","Value","Yny0","YNY0"]
["VECTOR_GROUP","Value","Ynyn0","YNYN0"]
["VECTOR_GROUP","Value","YNYN0D1","YNYN0D1"]
["VECTOR_GROUP","Value","YNYND1","YNYND1"]
["VECTOR_GROUP","Value","YNZN11","YNZN11"]
["VECTOR_GROUP","Value","Yy0","YY0"]
["VECTOR_GROUP","Value","YY0D1","YY0D1"]
["VECTOR_GROUP","Value","Yz11","YZ11"]
["VECTOR_GROUP","Value","YZN11","YZN11"]
["VOLTAGE_NOMINAL","Header","Description","Code"]
["VOLTAGE_NOMINAL","Value","0","0"]
["VOLTAGE_NOMINAL","Value","5","5"]
["VOLTAGE_NOMINAL","Value","12","12"]
["VOLTAGE_NOMINAL","Value","24","24"]
["VOLTAGE_NOMINAL","Value","30","30"]
["VOLTAGE_NOMINAL","Value","32","32"]
["VOLTAGE_NOMINAL","Value","48","48"]
["VOLTAGE_NOMINAL","Value","50","50"]
["VOLTAGE_NOMINAL","Value","110","110"]
["VOLTAGE_NOMINAL","Value","120","120"]
["VOLTAGE_NOMINAL","Value","130","130"]
["VOLTAGE_NOMINAL","Value","230","230"]
["VOLTAGE_NOMINAL","Value","240","240"]
["VOLTAGE_NOMINAL","Value","250","250"]
["VOLTAGE_NOMINAL","Value","415","415"]
["VOLTAGE_NOMINAL","Value","430","430"]
["VOLTAGE_NOMINAL","Value","433","433"]
["VOLTAGE_NOMINAL","Value","500","500"]
["VOLTAGE_NOMINAL","Value","3300","3300"]
["VOLTAGE_NOMINAL","Value","6600","6600"]
["VOLTAGE_NOMINAL","Value","11000","11000"]
["VOLTAGE_NOMINAL","Value","22000","22000"]
["VOLTAGE_NOMINAL","Value","33000","33000"]
["VOLTAGE_NOMINAL","Value","66000","66000"]
["VOLTAGE_NOMINAL","Value","132000","132000"]
["VOLTAGE_NOMINAL","Value","330000","330000"]
["VOLT_TRIP_CLOSE","Header","Description","Code"]
["VOLT_TRIP_CLOSE","Value","0","0"]
["VOLT_TRIP_CLOSE","Value","12","12"]
["VOLT_TRIP_CLOSE","Value","24","24"]
["VOLT_TRIP_CLOSE","Value","30","30"]
["VOLT_TRIP_CLOSE","Value","32","32"]
["VOLT_TRIP_CLOSE","Value","100","100"]
["VOLT_TRIP_CLOSE","Value","110","110"]
["VOLT_TRIP_CLOSE","Value","120","120"]
["VOLT_TRIP_CLOSE","Value","125","125"]
["VOLT_TRIP_CLOSE","Value","132","132"]
["VOLT_TRIP_CLOSE","Value","240","240"]
["EQ_TOT_D","Header","Description","Code"]
["EQ_TOT_D","Value","Battery","BT_BATT"]
["EQ_TOT_D","Value","Battery Charger","BT_BATTCH"]
["EQ_TOT_D","Value","Pole Capacitor Bank","CU_PLCPBK"]
["EQ_TOT_D","Value","Bus Section Unit","DG_BUSUNT"]
["EQ_TOT_D","Value","Cable Term Unit","DG_CABTRM"]
["EQ_TOT_D","Value","Combination Swgr","DG_CMBSW"]
["EQ_TOT_D","Value","Direct Con - HV","DG_DCHV"]
["EQ_TOT_D","Value","Isol/Disc - LV - GD","DG_ISLVGD"]
["EQ_TOT_D","Value","Isol No Load Br - LV","DG_ISNLLV"]
["EQ_TOT_D","Value","Contactor","AF_CNTCTR"]
["EQ_TOT_D","Value","Access Track","AT_ATRCK"]
["EQ_TOT_D","Value","COMMS Battery","BT_CMBATT"]
["EQ_TOT_D","Value","Auxiliary Busbar Bay","BY_ABBY"]
["EQ_TOT_D","Value","Auxiliary Trf Bay","BY_ATBY"]
["EQ_TOT_D","Value","Bus Section Bay","BY_BSBY"]
["EQ_TOT_D","Value","Capacitor Bay","BY_CUBY"]
["EQ_TOT_D","Value","Civil Bay","BY_CVBY"]
["EQ_TOT_D","Value","Prot Scheme Bay","BY_PSBY"]
["EQ_TOT_D","Value","SCADA & COMMS Bay","BY_SCBY"]
["EQ_TOT_D","Value","Service Bay","BY_SRVCBY"]
["EQ_TOT_D","Value","Integrated CB","CB_INTCB"]
["EQ_TOT_D","Value","Dishwasher","CE_DSHWSR"]
["EQ_TOT_D","Value","Communications Dish","CM_CMDISH"]
["EQ_TOT_D","Value","Communications","CM_COMMS"]
["EQ_TOT_D","Value","DSUB Radio","CM_DSRAD"]
["EQ_TOT_D","Value","Microwave","CM_MCRWV"]
["EQ_TOT_D","Value","MPLS","CM_MPLS"]
["EQ_TOT_D","Value","TSUB Radio","CM_TSRAD"]
["EQ_TOT_D","Value","Tower Radio","CM_TWRAD"]
["EQ_TOT_D","Value","UHF Base","CM_UHFB"]
["EQ_TOT_D","Value","Back Flow Prevention","CV_BCKFLW"]
["EQ_TOT_D","Value","Building","CV_BLDG"]
["EQ_TOT_D","Value","Building Floor Sectn","CV_BLDGFL"]
["EQ_TOT_D","Value","Building Lighting","CV_BLDGLT"]
["EQ_TOT_D","Value","Building Roof","CV_BLDGRF"]
["EQ_TOT_D","Value","Building Workshop","CV_BLDGWS"]
["EQ_TOT_D","Value","Cage Enclosure","CV_CAGE"]
["EQ_TOT_D","Value","Safe Clearance Fence","CV_CLRFNC"]
["EQ_TOT_D","Value","Communications Room","CV_COMSRM"]
["EQ_TOT_D","Value","Deluge Shower","CV_DELUGE"]
["EQ_TOT_D","Value","Door - Sliding","CV_DRSLD"]
["EQ_TOT_D","Value","Door - Roller","CV_DRSROL"]
["EQ_TOT_D","Value","Door - Standard","CV_DRSTD"]
["EQ_TOT_D","Value","Driveway","CV_DRVWY"]
["EQ_TOT_D","Value","Eye Wash Station","CV_EYEWSH"]
["EQ_TOT_D","Value","Fire Wall","CV_FIRWLL"]
["EQ_TOT_D","Value","Inside Vegetation","CV_INVEG"]
["EQ_TOT_D","Value","Lightning Mast","CV_LGTNMT"]
["EQ_TOT_D","Value","Lighting Tower","CV_LGTTWR"]
["EQ_TOT_D","Value","Lunch Room","CV_LNCHRM"]
["EQ_TOT_D","Value","Landing Span/Gantry","CV_LNDSPN"]
["EQ_TOT_D","Value","Modular Building","CV_MDBLDG"]
["EQ_TOT_D","Value","Metal Enclosure","CV_MTLENC"]
["EQ_TOT_D","Value","Noise Wall","CV_NOIWLL"]
["EQ_TOT_D","Value","Oil Water Separator","CV_OILSEP"]
["EQ_TOT_D","Value","Oil Spray Wall","CV_OILWLL"]
["EQ_TOT_D","Value","Outside Vegetation","CV_OUTVEG"]
["EQ_TOT_D","Value","Personal Access Gate","CV_PAGATE"]
["EQ_TOT_D","Value","Perimeter Fence","CV_PFENCE"]
["EQ_TOT_D","Value","Septic Tank","CV_SEPTNK"]
["EQ_TOT_D","Value","Spill Kit","CV_SPLKIT"]
["EQ_TOT_D","Value","Storage Tank","CV_STRTNK"]
["EQ_TOT_D","Value","Toilet","CV_TOILET"]
["EQ_TOT_D","Value","Trench","CV_TRNH"]
["EQ_TOT_D","Value","Trench Cover","CV_TRNHCO"]
["EQ_TOT_D","Value","Vehicle Access Gate","CV_VHGATE"]
["EQ_TOT_D","Value","Water Pump Set","CV_WPUMP"]
["EQ_TOT_D","Value","Washbay","CV_WSHBAY"]
["EQ_TOT_D","Value","Water Storage Tank","CV_WSTTNK"]
["EQ_TOT_D","Value","Water Supply","CV_WTSPLY"]
["EQ_TOT_D","Value","Yard Area","CV_YARD"]
["EQ_TOT_D","Value","Combination Sw Stn","DG_CMBSWS"]
["EQ_TOT_D","Value","Direct Con - LV - GD","DG_DCLVGD"]
["EQ_TOT_D","Value","Dist Earth Switch","DG_ERSWD"]
["EQ_TOT_D","Value","DSUB Monitor","DM_SUBMON"]
["EQ_TOT_D","Value","Regulating Pole Sub","DS_RPLSUB"]
["EQ_TOT_D","Value","SWER Isolating Sub","DS_SWERIS"]
["EQ_TOT_D","Value","Earth Grid","ER_ERGRID"]
["EQ_TOT_D","Value","Portable Earth","ER_ERPORT"]
["EQ_TOT_D","Value","Fire Blankets - Gel","FE_FBLGEL"]
["EQ_TOT_D","Value","Fire Door - Sliding","FE_FDRSLD"]
["EQ_TOT_D","Value","Fire Door - Standard","FE_FDRSTD"]
["EQ_TOT_D","Value","Fire Extinguisher","FE_FEXTGH"]
["EQ_TOT_D","Value","Fire Pump Set","FE_FPUMP"]
["EQ_TOT_D","Value","Fire Storage Tank","FE_FSTTNK"]
["EQ_TOT_D","Value","Fire/Water Equipment","FE_FWEQ"]
["EQ_TOT_D","Value","Hose Reel","FE_HOSERL"]
["EQ_TOT_D","Value","Fire Hydrant","FE_HYDRNT"]
["EQ_TOT_D","Value","Sprinkler Valve Sys","FE_SPRKLV"]
["EQ_TOT_D","Value","Generator Facility","GN_GENRTR"]
["EQ_TOT_D","Value","Anchor Point","HS_ANCPNT"]
["EQ_TOT_D","Value","Fall Arrestor","HS_FALART"]
["EQ_TOT_D","Value","Harness and Lanyard","HS_HARNES"]
["EQ_TOT_D","Value","Hardware Server","HW_SERVER"]
["EQ_TOT_D","Value","Lift Personnel","LF_LIFT"]
["EQ_TOT_D","Value","Cylinder Lock","LK_CYLNLK"]
["EQ_TOT_D","Value","Padlock","LK_PADLK"]
["EQ_TOT_D","Value","Pole Map","MP_POLEMP"]
["EQ_TOT_D","Value","Streetlight Map","MP_SLGTMP"]
["EQ_TOT_D","Value","Vegetation Map","MP_VEGEMP"]
["EQ_TOT_D","Value","HV Overhead Assembly","OH_HVASSM"]
["EQ_TOT_D","Value","LV Overhead Assembly","OH_LVASSM"]
["EQ_TOT_D","Value","TR Overhead Assembly","OH_TRASSM"]
["EQ_TOT_D","Value","Composite Fibre Pole","PL_CMPFPL"]
["EQ_TOT_D","Value","Concrete Pole","PL_CONPL"]
["EQ_TOT_D","Value","Steel Pole","PL_STLPL"]
["EQ_TOT_D","Value","Wood Pole","PL_WOODPL"]
["EQ_TOT_D","Value","AUX & Tripping Relay","PR_AUXTPR"]
["EQ_TOT_D","Value","Busbar Prot Relay","PR_BUSPR"]
["EQ_TOT_D","Value","Distance Prot Relay","PR_DISTPR"]
["EQ_TOT_D","Value","Feeder Diff Relay","PR_FDDFPR"]
["EQ_TOT_D","Value","Knife Switch - LV","DG_KNFLV"]
["EQ_TOT_D","Value","LV Switchgear","DG_LVSWGR"]
["EQ_TOT_D","Value","Steel Encl Swbd - LV","DG_SSWBLV"]
["EQ_TOT_D","Value","HV Switch/Fuse Unit","DG_SWFUNT"]
["EQ_TOT_D","Value","Sw Load Break - LV","DG_SWLBLV"]
["EQ_TOT_D","Value","HV Switch Unit","DG_SWUNT"]
["EQ_TOT_D","Value","Cubicle Swtchng Stn","DS_CUBSW"]
["EQ_TOT_D","Value","Indoor Swtchng Stn","DS_INDSW"]
["EQ_TOT_D","Value","Single Pole Sub","DS_PLSUB"]
["EQ_TOT_D","Value","Emergency Exit Light","FE_EMEXLT"]
["EQ_TOT_D","Value","Fire Alarm Detector","FE_FALRMD"]
["EQ_TOT_D","Value","Fire Alarm Panel","FE_FALRMP"]
["EQ_TOT_D","Value","Fire Blankets - Dry","FE_FBLDRY"]
["EQ_TOT_D","Value","Fire Damper HVAC","FE_FDHVAC"]
["EQ_TOT_D","Value","Fire Shutters/Vent","FE_FSHVNT"]
["EQ_TOT_D","Value","Gas Suppression Sys","FE_GASSSY"]
["EQ_TOT_D","Value","LV Pillar Box","LP_PILBOX"]
["EQ_TOT_D","Value","LV Pillar Cubicle","LP_PILCUB"]
["EQ_TOT_D","Value","Pilot Termination","OH_PCTE"]
["EQ_TOT_D","Value","UG/OH Termination","OH_UGOH"]
["EQ_TOT_D","Value","Max Demand Indicator","SE_MDI"]
["EQ_TOT_D","Value","Streetlight Ctrl Pt","SL_CTRLPT"]
["EQ_TOT_D","Value","Air Break Switch","SW_ABS"]
["EQ_TOT_D","Value","Load Break Switch","SW_LBS"]
["EQ_TOT_D","Value","Link","SW_LINK"]
["EQ_TOT_D","Value","Link/Fuse","SW_LINKF"]
["EQ_TOT_D","Value","LV Links","SW_LVLINK"]
["EQ_TOT_D","Value","Recloser","SW_RECL"]
["EQ_TOT_D","Value","Sectionaliser","SW_SECT"]
["EQ_TOT_D","Value","Under Slung Link","SW_USL"]
["EQ_TOT_D","Value","Optus Asset","TP_OPTUS"]
["EQ_TOT_D","Value","Third Party Asset","TP_OTHER"]
["EQ_TOT_D","Value","RMS Traffic Signals","TP_RMSTCS"]
["EQ_TOT_D","Value","Telstra Asset","TP_TELSTR"]
["EQ_TOT_D","Value","Building Modular","CV_BLDGMD"]
["EQ_TOT_D","Value","Coupling Cell Cap","AF_CPLCAP"]
["EQ_TOT_D","Value","Coupling Cell Coils","AF_CPLCL"]
["EQ_TOT_D","Value","Motor Generator Set","AF_MTRGEN"]
["EQ_TOT_D","Value","Static Freq Unit","AF_SFU"]
["EQ_TOT_D","Value","Supervision Unit","AF_SVU"]
["EQ_TOT_D","Value","Aerial Marker Ball","AM_AMBALL"]
["EQ_TOT_D","Value","Artwork","AR_ARTWRK"]
["EQ_TOT_D","Value","Accs Trk Entry Point","AT_ENTYPT"]
["EQ_TOT_D","Value","Vhcle Accs Trk Gte","AT_VHACGT"]
["EQ_TOT_D","Value","Acc Trk Water Cross","AT_VHWYCR"]
["EQ_TOT_D","Value","Automatic Doors","BF_ATDOOR"]
["EQ_TOT_D","Value","Roller Shutter Doors","BF_SHUTTR"]
["EQ_TOT_D","Value","AFIC Bay","BY_AFBY"]
["EQ_TOT_D","Value","Busbar Bay","BY_BRBY"]
["EQ_TOT_D","Value","Battery Bay","BY_BTBY"]
["EQ_TOT_D","Value","Feeder Bay","BY_FDBY"]
["EQ_TOT_D","Value","Overhead Bay","BY_OHBAY"]
["EQ_TOT_D","Value","Transformer Bay","BY_TXBY"]
["EQ_TOT_D","Value","Circuit breaker - HV","CB_CBHV"]
["EQ_TOT_D","Value","Circuit breaker - LV","CB_CBLV"]
["EQ_TOT_D","Value","CB - LV - PL","CB_CBLVPL"]
["EQ_TOT_D","Value","Dead Tank CB","CB_DTKCB"]
["EQ_TOT_D","Value","Live Tank CB","CB_LTKCB"]
["EQ_TOT_D","Value","Recloser CB","CB_RECLCB"]
["EQ_TOT_D","Value","CB Truck","CB_TRUKCB"]
["EQ_TOT_D","Value","Transmission Zone CB","CB_TSZSCB"]
["EQ_TOT_D","Value","Bain Marie","CE_BAINMA"]
["EQ_TOT_D","Value","BBQ","CE_BBQ"]
["EQ_TOT_D","Value","Boiling Water Unit","CE_BOILWT"]
["EQ_TOT_D","Value","Bratt Pan","CE_BRATTP"]
["EQ_TOT_D","Value","Coolroom Freezer","CE_CRFRZR"]
["EQ_TOT_D","Value","Coolroom Refridgertr","CE_CRREFD"]
["EQ_TOT_D","Value","Deep Fryer","CE_DFRYER"]
["EQ_TOT_D","Value","Grill","CE_GRILL"]
["EQ_TOT_D","Value","Ice Machine","CE_ICEMCH"]
["EQ_TOT_D","Value","Oven","CE_OVEN"]
["EQ_TOT_D","Value","Plate Warmer","CE_PLWARM"]
["EQ_TOT_D","Value","Salamander","CE_SLMNDR"]
["EQ_TOT_D","Value","Stove","CE_STOVE"]
["EQ_TOT_D","Value","Vending Machine","CE_VENDMA"]
["EQ_TOT_D","Value","Fuel and Chemicals","CH_FLCHEM"]
["EQ_TOT_D","Value","Gas Bottle","CH_GASBOT"]
["EQ_TOT_D","Value","Fuel Tank","CH_TNKFUL"]
["EQ_TOT_D","Value","Column Concrete (SL)","CL_CNSLCL"]
["EQ_TOT_D","Value","Column Steel (LV)","CL_STLVCL"]
["EQ_TOT_D","Value","Column Steel (SL)","CL_STSLCL"]
["EQ_TOT_D","Value","Communications Equip","CM_CMEQUP"]
["EQ_TOT_D","Value","Communications Site","CM_CMSITE"]
["EQ_TOT_D","Value","3G/4G Modem","CM_MODEMM"]
["EQ_TOT_D","Value","Switch Controller","CM_SWCTRL"]
["EQ_TOT_D","Value","Switch Radio","CM_SWRAD"]
["EQ_TOT_D","Value","Crane - Bridge","CN_BRDGCN"]
["EQ_TOT_D","Value","Crane - Gantry","CN_GNTYCN"]
["EQ_TOT_D","Value","Crane - Jib","CN_JIBCN"]
["EQ_TOT_D","Value","Crane - Portal","CN_PRTLCN"]
["EQ_TOT_D","Value","Core Balance CT","CT_CRBLCT"]
["EQ_TOT_D","Value","Epoxy CT","CT_EPXYCT"]
["EQ_TOT_D","Value","Integrated CT","CT_INTCT"]
["EQ_TOT_D","Value","Metering CT","CT_MTRCT"]
["EQ_TOT_D","Value","Neutral Earth CT","CT_NERCT"]
["EQ_TOT_D","Value","Neutral Unbalance CT","CT_NUBCT"]
["EQ_TOT_D","Value","Post CT","CT_POSTCT"]
["EQ_TOT_D","Value","Indoor Capacitor","CU_INCAP"]
["EQ_TOT_D","Value","Outdoor Capacitor","CU_ODCAP"]
["EQ_TOT_D","Value","Outdoor Enclosed Cap","CU_ODECAP"]
["EQ_TOT_D","Value","Air Conditioner","CV_AIRCON"]
["EQ_TOT_D","Value","Bathroom","CV_BATHRM"]
["EQ_TOT_D","Value","Building Store","CV_BLDGST"]
["EQ_TOT_D","Value","Bund Wall","CV_BNDWLL"]
["EQ_TOT_D","Value","Brick Enclosure","CV_BRKENC"]
["EQ_TOT_D","Value","Staff Carpark","CV_CARPRK"]
["EQ_TOT_D","Value","Catering Section","CV_CATRNG"]
["EQ_TOT_D","Value","Chain Wire Enclosure","CV_CHNFNC"]
["EQ_TOT_D","Value","Composite Cubicle","CV_CMPCUB"]
["EQ_TOT_D","Value","Corridor","CV_CORDRM"]
["EQ_TOT_D","Value","Foyer","CV_FOYRRM"]
["EQ_TOT_D","Value","General Area","CV_GENRRM"]
["EQ_TOT_D","Value","Kitchenette","CV_KITCRM"]
["EQ_TOT_D","Value","LV Rescue Kit","CV_LVRESK"]
["EQ_TOT_D","Value","Meeting Room","CV_MEETRM"]
["EQ_TOT_D","Value","Office","CV_OFFCRM"]
["EQ_TOT_D","Value","Outdoor Lunch Area","CV_OUTLNC"]
["EQ_TOT_D","Value","RCDs","CV_RCD"]
["EQ_TOT_D","Value","Roof Access System","CV_RFACSY"]
["EQ_TOT_D","Value","Steel Cubicle","CV_STLCUB"]
["EQ_TOT_D","Value","Cleaner Store Room","CV_STORRM"]
["EQ_TOT_D","Value","Switch Yard","CV_SWYD"]
["EQ_TOT_D","Value","Pit Trans/Zone Sub","CV_TSPIT"]
["EQ_TOT_D","Value","DangerousGoods Store","DA_DNGSTR"]
["EQ_TOT_D","Value","Direct Con - LV - PL","DG_DCLVPL"]
["EQ_TOT_D","Value","Generator Link - LV","DG_GENLK"]
["EQ_TOT_D","Value","HV Busbar","DG_HVBUSB"]
["EQ_TOT_D","Value","LV Busbar","DG_LVBUSB"]
["EQ_TOT_D","Value","Switch Fuse - LV","DG_SWFSLV"]
["EQ_TOT_D","Value","Sw Fuse - LV - PL","DG_SWFSPL"]
["EQ_TOT_D","Value","Central Logistic Fac","DP_CLF"]
["EQ_TOT_D","Value","Communications Hut","DP_CMH"]
["EQ_TOT_D","Value","Field Service Centre","DP_FSC"]
["EQ_TOT_D","Value","Office Location","DP_OFFICE"]
["EQ_TOT_D","Value","Tech Training Centre","DP_TTC"]
["EQ_TOT_D","Value","Cottage Substation","DS_COTSUB"]
["EQ_TOT_D","Value","Ground Substation","DS_GNDSUB"]
["EQ_TOT_D","Value","Private Sub/HVC","DS_HVCSUB"]
["EQ_TOT_D","Value","Indoor Substation","DS_INDSUB"]
["EQ_TOT_D","Value","Kiosk Substation","DS_KSKSUB"]
["EQ_TOT_D","Value","Padmount Substation","DS_PADSUB"]
["EQ_TOT_D","Value","Regulating Sub - GD","DS_REGSUB"]
["EQ_TOT_D","Value","SWER Substation","DS_SWERSB"]
["EQ_TOT_D","Value","First Aid Defibrlltr","FA_DEFIB"]
["EQ_TOT_D","Value","CCP","FD_CCP"]
["EQ_TOT_D","Value","CCP High Voltage Cus","FD_CCPHVC"]
["EQ_TOT_D","Value","Property Sub Lease","PY_SUBLEA"]
["EQ_TOT_D","Value","CCP Unmetered Supply","FD_CCPUMS"]
["EQ_TOT_D","Value","Dist Earth Wire","FD_FEEDDE"]
["EQ_TOT_D","Value","Feeder","FD_FEEDER"]
["EQ_TOT_D","Value","Earth Wire","FD_FEEDEW"]
["EQ_TOT_D","Value","Pilot Wire","FD_FEEDPI"]
["EQ_TOT_D","Value","Isolatable Section","FD_ISOSEC"]
["EQ_TOT_D","Value","OH Consumer Mains","FD_OHCONM"]
["EQ_TOT_D","Value","Dist OH EarthWire CS","FD_OHCSDE"]
["EQ_TOT_D","Value","OH Conductor Segment","FD_OHCSEG"]
["EQ_TOT_D","Value","OH Earth Wire CS","FD_OHCSEW"]
["EQ_TOT_D","Value","OH Cond Segm Pilot","FD_OHCSPI"]
["EQ_TOT_D","Value","OH Service Line","FD_OHSRVC"]
["EQ_TOT_D","Value","Point of Attachment","FD_POA"]
["EQ_TOT_D","Value","UG Consumer Mains","FD_UGCONM"]
["EQ_TOT_D","Value","Dist UG EarthWire CS","FD_UGCSDE"]
["EQ_TOT_D","Value","UG Conductor Segment","FD_UGCSEG"]
["EQ_TOT_D","Value","UG Earth Wire CS","FD_UGCSEW"]
["EQ_TOT_D","Value","UG Cond Seg Pilot","FD_UGCSPI"]
["EQ_TOT_D","Value","UG Service Line","FD_UGSRVC"]
["EQ_TOT_D","Value","Fire Indicator Panel","FE_FIP"]
["EQ_TOT_D","Value","Smoke Hutch","FE_SMHTCH"]
["EQ_TOT_D","Value","VESDA","FE_VESDA"]
["EQ_TOT_D","Value","Line Fault Indicator","FI_LFI"]
["EQ_TOT_D","Value","Car","FL_CR"]
["EQ_TOT_D","Value","ElevatedWork Platfom","FL_EWP"]
["EQ_TOT_D","Value","Light Commercial","FL_LC"]
["EQ_TOT_D","Value","Crane Borer","FL_PB"]
["EQ_TOT_D","Value","VehicleLoading Crane","FL_PC"]
["EQ_TOT_D","Value","Forklift","FL_PF"]
["EQ_TOT_D","Value","Trailer","FL_PT"]
["EQ_TOT_D","Value","Cable Winch","FL_PW"]
["EQ_TOT_D","Value","Specialised Plant","FL_PX"]
["EQ_TOT_D","Value","Truck","FL_TR"]
["EQ_TOT_D","Value","Vehicle Telematics","FL_VEHTEL"]
["EQ_TOT_D","Value","UG Termination","GD_UGTERM"]
["EQ_TOT_D","Value","Generator","GN_GENATR"]
["EQ_TOT_D","Value","Property Sub Licence","PY_SUBLIC"]
["EQ_TOT_D","Value","HVAC Air Con Pump","HC_ACPUMP"]
["EQ_TOT_D","Value","HVAC Air Handlng Unt","HC_AHU"]
["EQ_TOT_D","Value","HVAC Chiller","HC_CHILLR"]
["EQ_TOT_D","Value","HVAC Cooling Tower","HC_CLTOWR"]
["EQ_TOT_D","Value","HVAC Exhaust Fan","HC_EXHFAN"]
["EQ_TOT_D","Value","HVAC Fan Coil Unit","HC_FCU"]
["EQ_TOT_D","Value","HVAC fume Cupboard","HC_FUMECP"]
["EQ_TOT_D","Value","Hotwater system","HC_HOTWTR"]
["EQ_TOT_D","Value","HVAC Split System","HC_SPLSYS"]
["EQ_TOT_D","Value","Height Safety","HS_HEIGHT"]
["EQ_TOT_D","Value","Ladder and Platform","HS_LADDER"]
["EQ_TOT_D","Value","Ladder Fixing Point","HS_LADDFP"]
["EQ_TOT_D","Value","Static Line","HS_STATLN"]
["EQ_TOT_D","Value","Camera","HW_CAMERA"]
["EQ_TOT_D","Value","PC Desktop","HW_DESKTP"]
["EQ_TOT_D","Value","Docking Station","HW_DSTATN"]
["EQ_TOT_D","Value","Fax Machine","HW_FAX"]
["EQ_TOT_D","Value","IT Cable","HW_ITCBLE"]
["EQ_TOT_D","Value","IT Power Supply","HW_ITPSUP"]
["EQ_TOT_D","Value","PC Laptop","HW_LAPTOP"]
["EQ_TOT_D","Value","Multiplexer","HW_MLTIPL"]
["EQ_TOT_D","Value","Mobile Phone","HW_MOBILE"]
["EQ_TOT_D","Value","Modem","HW_MODEM"]
["EQ_TOT_D","Value","Monitor","HW_MONITR"]
["EQ_TOT_D","Value","Mobile Radio","HW_MRADIO"]
["EQ_TOT_D","Value","Navigator","HW_NAVIGT"]
["EQ_TOT_D","Value","Network Hub","HW_NETHUB"]
["EQ_TOT_D","Value","Land Line Phone","HW_PHONLL"]
["EQ_TOT_D","Value","Printer","HW_PRINTR"]
["EQ_TOT_D","Value","Router","HW_ROUTR"]
["EQ_TOT_D","Value","Scada Comms Equip","HW_SCADA"]
["EQ_TOT_D","Value","Storage Device","HW_SDEVIC"]
["EQ_TOT_D","Value","Server Rack","HW_SVRRCK"]
["EQ_TOT_D","Value","Network Switch","HW_SWITCH"]
["EQ_TOT_D","Value","PC Tablet","HW_TABLET"]
["EQ_TOT_D","Value","Telephonics","HW_TELEPH"]
["EQ_TOT_D","Value","Unintrptd Pwr Spply","HW_UPS"]
["EQ_TOT_D","Value","Moble Wireless Card","HW_WICARD"]
["EQ_TOT_D","Value","Instrument","IN_INSTMT"]
["EQ_TOT_D","Value","IT Equipment","IT_ITEQUI"]
["EQ_TOT_D","Value","Motor Box","MB_MTRBOX"]
["EQ_TOT_D","Value","Night Watch Bracket","NW_BRKTNW"]
["EQ_TOT_D","Value","Night Watch Lantern","NW_LTRNNW"]
["EQ_TOT_D","Value","Night Watch","NW_NGTWCH"]
["EQ_TOT_D","Value","Earth Wire Assembly","OH_EWIRE"]
["EQ_TOT_D","Value","OH Conductor Joint","OH_OHJNT"]
["EQ_TOT_D","Value","OPGW","OH_OPGW"]
["EQ_TOT_D","Value","Pilot Cable","OH_PILOT"]
["EQ_TOT_D","Value","Pit","PI_PIT"]
["EQ_TOT_D","Value","OC/EF/SEF Prot Relay","PR_OCEFPR"]
["EQ_TOT_D","Value","Trf Auxiliary Relay","PR_TXAXPR"]
["EQ_TOT_D","Value","Trf Diff Relay","PR_TXDFPR"]
["EQ_TOT_D","Value","Underfrequency Relay","PR_UFPR"]
["EQ_TOT_D","Value","Voltage Prot Relay","PR_VOLTPR"]
["EQ_TOT_D","Value","AFIC Protection","PS_AFICPS"]
["EQ_TOT_D","Value","AUX Trf Protection","PS_ATRFPS"]
["EQ_TOT_D","Value","Busbar Protection","PS_BSBRPS"]
["EQ_TOT_D","Value","Capacitor Protection","PS_CAPPS"]
["EQ_TOT_D","Value","DSUB Protection","PS_DSUBPS"]
["EQ_TOT_D","Value","Feeder Protection","PS_FDPS"]
["EQ_TOT_D","Value","Recloser Protection","PS_RECLPS"]
["EQ_TOT_D","Value","Trf Protection","PS_TRFPS"]
["EQ_TOT_D","Value","U/F Load Shed Prot","PS_UFLDPS"]
["EQ_TOT_D","Value","Easement","PY_ESMNT"]
["EQ_TOT_D","Value","Property Freehold","PY_FREEHD"]
["EQ_TOT_D","Value","Property Lease","PY_LEASE"]
["EQ_TOT_D","Value","Property Licence","PY_LICENC"]
["EQ_TOT_D","Value","Prop Statutory Right","PY_STATRT"]
["EQ_TOT_D","Value","OH River Crossing","RC_OHRIV"]
["EQ_TOT_D","Value","Submarine R Crossing","RC_SUBRIV"]
["EQ_TOT_D","Value","Cap Dischrge Reactor","RE_CAPDIS"]
["EQ_TOT_D","Value","Cap Switch Reactor","RE_CAPSW"]
["EQ_TOT_D","Value","Neutral Erth Reactor","RE_NEREAC"]
["EQ_TOT_D","Value","Neut Erth Resistor","RE_NERES"]
["EQ_TOT_D","Value","Damaged Asset","RT_DASSET"]
["EQ_TOT_D","Value","New Asset","RT_NASSET"]
["EQ_TOT_D","Value","Recovered Asset","RT_RASSET"]
["EQ_TOT_D","Value","Scrap Asset","RT_SASSET"]
["EQ_TOT_D","Value","Rotable Asset Store","RT_STORE"]
["EQ_TOT_D","Value","Scale","SA_SCALE"]
["EQ_TOT_D","Value","Main Switch Board","SB_MSB"]
["EQ_TOT_D","Value","AIM Module","SC_AIM"]
["EQ_TOT_D","Value","DIM Module","SC_DIM"]
["EQ_TOT_D","Value","Distributed IO","SC_DISIO"]
["EQ_TOT_D","Value","Distributed RTU","SC_DISRTU"]
["EQ_TOT_D","Value","DOM/POM Module","SC_DOMPOM"]
["EQ_TOT_D","Value","Protocol Gateway","SC_GATEWY"]
["EQ_TOT_D","Value","GPS","SC_GPS"]
["EQ_TOT_D","Value","Human-Mach Interface","SC_HMI"]
["EQ_TOT_D","Value","SCADA LAN Device","SC_LAN"]
["EQ_TOT_D","Value","Media Converter","SC_MCNVTR"]
["EQ_TOT_D","Value","Scada Network Switch","SC_NETSW"]
["EQ_TOT_D","Value","Other Device","SC_OTHDV"]
["EQ_TOT_D","Value","Cut Down Rack","SC_RACKCU"]
["EQ_TOT_D","Value","Full Rack","SC_RACKFU"]
["EQ_TOT_D","Value","Scada Router","SC_ROUTER"]
["EQ_TOT_D","Value","Remote Terminal Unit","SC_RTU"]
["EQ_TOT_D","Value","Security Device","SC_SCTYDV"]
["EQ_TOT_D","Value","Terminal Server","SC_TMLSVR"]
["EQ_TOT_D","Value","Zac Controller","SC_ZAC"]
["EQ_TOT_D","Value","Surge Diverters","SE_SRGDIV"]
["EQ_TOT_D","Value","Helicopter Helmet","SF_HELMET"]
["EQ_TOT_D","Value","Streetlight Bracket","SL_BRKTSL"]
["EQ_TOT_D","Value","Streetlight Lantern","SL_LTRNSL"]
["EQ_TOT_D","Value","Streetlight Outreach","SL_OTRCSL"]
["EQ_TOT_D","Value","Street Lighting","SL_STLGHT"]
["EQ_TOT_D","Value","Software","SO_SOFTWR"]
["EQ_TOT_D","Value","OH Spreader","SP_OHSPRD"]
["EQ_TOT_D","Value","Security CCTV","SS_CCTV"]
["EQ_TOT_D","Value","Security Intercomms","SS_INTCOM"]
["EQ_TOT_D","Value","Safe","SS_SAFE"]
["EQ_TOT_D","Value","Security System","SS_SECSYS"]
["EQ_TOT_D","Value","Structure Column","ST_CLMNST"]
["EQ_TOT_D","Value","Structure LV Pillar","ST_PILLST"]
["EQ_TOT_D","Value","Pit Structure","ST_PITST"]
["EQ_TOT_D","Value","Structure Pole","ST_POLEST"]
["EQ_TOT_D","Value","Structure Tower","ST_TOWRST"]
["EQ_TOT_D","Value","Drop Out Fuse Pole","SW_DOFPL"]
["EQ_TOT_D","Value","Drop Out Fuse PL Sub","SW_DOFSUB"]
["EQ_TOT_D","Value","Fuse Saver","SW_FUSAVR"]
["EQ_TOT_D","Value","LV Link Box","SW_LVLKBX"]
["EQ_TOT_D","Value","Tapchanger","TC_TAPCHG"]
["EQ_TOT_D","Value","Trans Busbar","TE_BUSBAR"]
["EQ_TOT_D","Value","Changeover Switch","TE_CHGOSW"]
["EQ_TOT_D","Value","Cap Contactor","TE_CNTCAP"]
["EQ_TOT_D","Value","Trans Disconnector","TE_DISC"]
["EQ_TOT_D","Value","Trans Earth Switch","TE_ERSWT"]
["EQ_TOT_D","Value","Trans Isolator","TE_ISOL"]
["EQ_TOT_D","Value","Trans Links","TE_LINKS"]
["EQ_TOT_D","Value","Plug-in Termination","TE_PLUGIN"]
["EQ_TOT_D","Value","Trans Surge Arrestor","TE_SURGE"]
["EQ_TOT_D","Value","UG Cable Segment","TE_UGSEG"]
["EQ_TOT_D","Value","Wall Bushing","TE_WLBUSH"]
["EQ_TOT_D","Value","Tool Electrc Powered","TO_ELEC"]
["EQ_TOT_D","Value","Hand Tools","TO_HAND"]
["EQ_TOT_D","Value","Tool Hydraulic Powrd","TO_HYDRLC"]
["EQ_TOT_D","Value","Miscellaneous Tool","TO_MISCTL"]
["EQ_TOT_D","Value","Tool Petrol Powered","TO_PETROL"]
["EQ_TOT_D","Value","Tools Pneumatic Pwrd","TO_PNEUMT"]
["EQ_TOT_D","Value","Tools Portable Earth","TO_PORERT"]
["EQ_TOT_D","Value","Portable Ladder","TO_PORTLD"]
["EQ_TOT_D","Value","Pressure Washer","TO_PRWSHR"]
["EQ_TOT_D","Value","Tool Battery Powered","TO_TBATT"]
["EQ_TOT_D","Value","NBN Asset","TP_NBN"]
["EQ_TOT_D","Value","Tower","TW_TOWER"]
["EQ_TOT_D","Value","Auto Transformer","TX_AUTOTX"]
["EQ_TOT_D","Value","Auxiliary Trf","TX_AUXTX"]
["EQ_TOT_D","Value","Cable Entry Trf","TX_CABETX"]
["EQ_TOT_D","Value","Earthing Transformer","TX_ERTHTX"]
["EQ_TOT_D","Value","Free Standing Trf","TX_FSTDTX"]
["EQ_TOT_D","Value","Ground Mounted Trf","TX_GDMTTX"]
["EQ_TOT_D","Value","Isolation Trf","TX_ISOLTX"]
["EQ_TOT_D","Value","Kiosk Transformer","TX_KSKTX"]
["EQ_TOT_D","Value","Padmount Transformer","TX_PADTX"]
["EQ_TOT_D","Value","Platform Transformer","TX_PLFMTX"]
["EQ_TOT_D","Value","Pole Mounted Trf","TX_PLMTTX"]
["EQ_TOT_D","Value","Power Transformer","TX_PWRTX"]
["EQ_TOT_D","Value","Voltage Reg Trf","TX_VREGTX"]
["EQ_TOT_D","Value","Bulk Supply Point","TZ_BSP"]
["EQ_TOT_D","Value","HVC Substation","TZ_HVC"]
["EQ_TOT_D","Value","Switching Station","TZ_SS"]
["EQ_TOT_D","Value","Trans Substation","TZ_TS"]
["EQ_TOT_D","Value","Zone Substation","TZ_ZS"]
["EQ_TOT_D","Value","UG Cable Joint","UG_UGJNT"]
["EQ_TOT_D","Value","UG Cable Node","UG_UGNODE"]
["EQ_TOT_D","Value","Undergrnd Duct Route","UG_UGROUT"]
["EQ_TOT_D","Value","Vibration Damper","VD_VIBDAM"]
["EQ_TOT_D","Value","Press Vess Air Rcvr","VP_ARECVR"]
["EQ_TOT_D","Value","Air Compressor","VP_COMPRS"]
["EQ_TOT_D","Value","Hydraulic Accumulatr","VP_HYRACC"]
["EQ_TOT_D","Value","Pressure Vessels","VP_PRSVES"]
["EQ_TOT_D","Value","3 Phase Magnetic VT","VT_3PHVT"]
["EQ_TOT_D","Value","Post Capacitor VT","VT_CAPVT"]
["EQ_TOT_D","Value","Metering (CCT) VT","VT_CCTVT"]
["EQ_TOT_D","Value","Integrated VT","VT_INTVT"]
["EQ_TOT_D","Value","Network VT","VT_NETVT"]
["EQ_TOT_D","Value","Post Magnetic VT","VT_POSTVT"]
["EQ_TOT_D","Value","VT Primary Fuse","VT_PRIMFS"]
["EQ_TOT_D","Value","VT Primary Link","VT_PRIMLK"]
["EQ_TOT_D","Value","Rackable Magnetic VT","VT_RACKVT"]
["EQ_TOT_D","Value","VT Secondary Fuse","VT_SECFS"]
["EQ_TOT_D","Value","GRN Radio","TO_GRNRAD"]
["EQ_TOT_D","Value","RefrigUnitCommercial","CE_FRIDGE"]
["EQ_TOT_D","Value","Fuel Filter","CH_FILTER"]
["EQ_TOT_D","Value","Fuel Pump","CH_FULPMP"]
["EQ_TOT_D","Value","Fuel Leak Detector","CH_LEAKDT"]
["EQ_TOT_D","Value","Vehicle Hoist","CN_VHOIST"]
["EQ_TOT_D","Value","FilterWaterTreatment","CV_FILTWT"]
["EQ_TOT_D","Value","Flow Meter Hydraulic","CV_FLOWMH"]
["EQ_TOT_D","Value","Macerator","CV_MACER"]
["EQ_TOT_D","Value","Pump Control Board","CV_PCTLBD"]
["EQ_TOT_D","Value","Stormwater Retention","CV_STWRET"]
["EQ_TOT_D","Value","Truck ExhstExtravtor","CV_TEXHXT"]
["EQ_TOT_D","Value","ThermostMixing Valve","CV_THMIXV"]
["EQ_TOT_D","Value","Valve","CV_VALVE"]
["EQ_TOT_D","Value","Auto Transfer Switch","GN_AUTTSW"]
["EQ_TOT_D","Value","Load Bank","GN_LDBANK"]
["EQ_TOT_D","Value","StaticTransSwitchSTS","GN_STS"]
["EQ_TOT_D","Value","Outside Air Fan","HC_OAIRFN"]
["EQ_TOT_D","Value","Supply Air Fan","HC_SAIRFN"]
["EQ_TOT_D","Value","VarAirVolume Box VAV","HC_VAV"]
["EQ_TOT_D","Value","VarRefrigVolBox VRV","HC_VRV"]
["EQ_TOT_D","Value","Var Speed Drive VSD","HC_VSD"]
["EQ_TOT_D","Value","Switchboard Distrib","SB_DISTSB"]
["EQ_TOT_D","Value","Switchboard Mech","SB_MECHSB"]
["EQ_TOT_D","Value","Solar Panels","SB_SOLPNL"]
["EQ_TOT_D","Value","Surge Protect Device","SB_SURGDV"]
["EQ_TOT_D","Value","Drying Cabinet","TO_DRYCAB"]
["EQ_TOT_D","Value","CPU or Comms Module","SC_CPU"]
["EQ_TOT_D","Value","HMI Computer","SC_HMIPC"]
["EQ_TOT_D","Value","HMI Screen","SC_HMISCR"]
["EQ_TOT_D","Value","Unintrptd PwrSup Lrg","UP_UPS"]
["EQ_TOT_D","Value","Chemical Dosing Faci","HC_PUMPST"]
["EQ_TOT_D","Value","CCP Main Switchboard","FD_CCPMSB"]
["EQ_TOT_D","Value","Crane - Gantry - ZS","CN_CRNGNT"]
["EQ_TOT_D","Value","HVAC Casstte AirCon","HC_ACCASS"]
["EQ_TOT_D","Value","HVAC Ducted AirCon","HC_ACDUCT"]
["EQ_TOT_D","Value","HVAC Cmptr Rm AirCon","HC_CRAC"]
["EQ_TOT_D","Value","Heat Vntltn & AirCon","HC_HVAC"]
["EQ_TOT_D","Value","Column & Pillar Map","MP_CLLPMP"]
["EQ_TOT_D","Value","VT Switch","VT_VTSW"]
["EQ_TOT_D","Value","Pump Set","CV_PUMPST"]
["EQ_TOT_D","Value","Auto Trf Substation","DS_ATSUB"]
["EQ_TOT_D","Value","Auto Trf Pole Sub","DS_ATSUBPL"]
["EQ_TOT_D","Value","HVAC AirCooled CondU","HC_AIRCCU"]
["EQ_TOT_D","Value","Chassis/Rack","SC_CHASS"]
["EQ_TOT_D","Value","Input Module","SC_INPM"]
["EQ_TOT_D","Value","RTU Peripheral","SC_PERI"]
["EQ_TOT_D","Value","Power Supply","SC_PSU"]
["EQ_TOT_D","Value","Isolation Trf AFIC","TX_ISTXAF"]
["EQ_TOT_D","Value","AC Control Panel","CP_ACCTRL"]
["EQ_TOT_D","Value","DC Control Panel","CP_DCCTRL"]
["EQ_TOT_D","Value","Gross Pollutant Tank","CV_GRPTK"]
["EQ_TOT_D","Value","Fibre Pit","FB_PITFIB"]
["EQ_TOT_D","Value","Fire Hyd Boost Valve","FE_FHYDBT"]
["EQ_TOT_D","Value","Generator TR Sub Aux","GN_GENTR"]
["EQ_TOT_D","Value","Link Cable Box","LB_LNKBOX"]
["EQ_TOT_D","Value","Oil Gauge","OL_OILGA"]
["EQ_TOT_D","Value","Oil Pit","OL_OILPIT"]
["EQ_TOT_D","Value","Oil Tank","OL_OILTK"]
["EQ_TOT_D","Value","Current Reactor","RE_CURR"]
["EQ_TOT_D","Value","Fault Thrower","TE_FLTCB"]
["EQ_TOT_D","Value","Trans Switchboard","TE_SWITB"]
["EQ_TOT_D","Value","Structure Link Cable","ST_LKBXST"]
["EQ_TOT_D","Value","Structure Fibre Pit","ST_PITFST"]
["EQ_TOT_D","Value","Structure Oil Pit","ST_PITOST"]
["EQ_TOT_D","Value","NetwCommunityBattery","BT_NETBATT"]
["EQ_TOT_D","Value","Early fault detector","FI_EFD"]
["EQ_TOT_D","Value","Drone & Accessories","HW_DRONE"]
["EQ_TOT_D","Value","LV BATTERY","BT_LVBATT"]
["EQ_TOT_D","Value","AV Equipment","HW_AVE"]
["EQ_TOT_D","Value","LV STATCOM","PQ_LVSTCM"]
["EQ_TOT_D","Value","Batt Ground Struct","BT_GRNDSTR"]
["EQ_TOT_D","Value","Battery Pole Struct","BT_POLESTR"]
["EQ_TOT_D","Value","STATCOM Pole Struct","PQ_POLESTR"]
["EQ_TOT_D","Value","CB Isolation","SW_CBIS"]
["EQ_TOT_D","Value","Fuse Isolation OH","SW_OHFSIS"]
["EQ_TOT_D","Value","Switch Isolation OH","SW_OHSWIS"]
["EQ_TOT_D","Value","Fuse Isolation UG","SW_UGFSIS"]
["EQ_TOT_D","Value","Switch Isolation UG","SW_UGSWIS"]
["EQ_TOT_D","Value","Streetlight SmartNod","SL_SMTNOD"]
["FLOC_TOT_D","Header","Description","Code"]
["FLOC_TOT_D","Value","Battery","BT_BATT"]
["FLOC_TOT_D","Value","Battery Charger","BT_BATTCH"]
["FLOC_TOT_D","Value","Pole Capacitor Bank","CU_PLCPBK"]
["FLOC_TOT_D","Value","Bus Section Unit","DG_BUSUNT"]
["FLOC_TOT_D","Value","Cable Term Unit","DG_CABTRM"]
["FLOC_TOT_D","Value","Combination Swgr","DG_CMBSW"]
["FLOC_TOT_D","Value","Direct Con - HV","DG_DCHV"]
["FLOC_TOT_D","Value","Isol/Disc - LV - GD","DG_ISLVGD"]
["FLOC_TOT_D","Value","Isol No Load Br - LV","DG_ISNLLV"]
["FLOC_TOT_D","Value","Contactor","AF_CNTCTR"]
["FLOC_TOT_D","Value","Access Track","AT_ATRCK"]
["FLOC_TOT_D","Value","COMMS Battery","BT_CMBATT"]
["FLOC_TOT_D","Value","Auxiliary Busbar Bay","BY_ABBY"]
["FLOC_TOT_D","Value","Auxiliary Trf Bay","BY_ATBY"]
["FLOC_TOT_D","Value","Bus Section Bay","BY_BSBY"]
["FLOC_TOT_D","Value","Capacitor Bay","BY_CUBY"]
["FLOC_TOT_D","Value","Civil Bay","BY_CVBY"]
["FLOC_TOT_D","Value","Prot Scheme Bay","BY_PSBY"]
["FLOC_TOT_D","Value","SCADA & COMMS Bay","BY_SCBY"]
["FLOC_TOT_D","Value","Service Bay","BY_SRVCBY"]
["FLOC_TOT_D","Value","Integrated CB","CB_INTCB"]
["FLOC_TOT_D","Value","Dishwasher","CE_DSHWSR"]
["FLOC_TOT_D","Value","Communications Dish","CM_CMDISH"]
["FLOC_TOT_D","Value","Communications","CM_COMMS"]
["FLOC_TOT_D","Value","DSUB Radio","CM_DSRAD"]
["FLOC_TOT_D","Value","Microwave","CM_MCRWV"]
["FLOC_TOT_D","Value","MPLS","CM_MPLS"]
["FLOC_TOT_D","Value","TSUB Radio","CM_TSRAD"]
["FLOC_TOT_D","Value","Tower Radio","CM_TWRAD"]
["FLOC_TOT_D","Value","UHF Base","CM_UHFB"]
["FLOC_TOT_D","Value","Back Flow Prevention","CV_BCKFLW"]
["FLOC_TOT_D","Value","Building","CV_BLDG"]
["FLOC_TOT_D","Value","Building Floor Sectn","CV_BLDGFL"]
["FLOC_TOT_D","Value","Building Lighting","CV_BLDGLT"]
["FLOC_TOT_D","Value","Building Roof","CV_BLDGRF"]
["FLOC_TOT_D","Value","Building Workshop","CV_BLDGWS"]
["FLOC_TOT_D","Value","Cage Enclosure","CV_CAGE"]
["FLOC_TOT_D","Value","Safe Clearance Fence","CV_CLRFNC"]
["FLOC_TOT_D","Value","Communications Room","CV_COMSRM"]
["FLOC_TOT_D","Value","Deluge Shower","CV_DELUGE"]
["FLOC_TOT_D","Value","Door - Sliding","CV_DRSLD"]
["FLOC_TOT_D","Value","Door - Roller","CV_DRSROL"]
["FLOC_TOT_D","Value","Door - Standard","CV_DRSTD"]
["FLOC_TOT_D","Value","Driveway","CV_DRVWY"]
["FLOC_TOT_D","Value","Eye Wash Station","CV_EYEWSH"]
["FLOC_TOT_D","Value","Fire Wall","CV_FIRWLL"]
["FLOC_TOT_D","Value","Inside Vegetation","CV_INVEG"]
["FLOC_TOT_D","Value","Lightning Mast","CV_LGTNMT"]
["FLOC_TOT_D","Value","Lighting Tower","CV_LGTTWR"]
["FLOC_TOT_D","Value","Lunch Room","CV_LNCHRM"]
["FLOC_TOT_D","Value","Landing Span/Gantry","CV_LNDSPN"]
["FLOC_TOT_D","Value","Modular Building","CV_MDBLDG"]
["FLOC_TOT_D","Value","Metal Enclosure","CV_MTLENC"]
["FLOC_TOT_D","Value","Noise Wall","CV_NOIWLL"]
["FLOC_TOT_D","Value","Oil Water Separator","CV_OILSEP"]
["FLOC_TOT_D","Value","Oil Spray Wall","CV_OILWLL"]
["FLOC_TOT_D","Value","Outside Vegetation","CV_OUTVEG"]
["FLOC_TOT_D","Value","Personal Access Gate","CV_PAGATE"]
["FLOC_TOT_D","Value","Perimeter Fence","CV_PFENCE"]
["FLOC_TOT_D","Value","Septic Tank","CV_SEPTNK"]
["FLOC_TOT_D","Value","Spill Kit","CV_SPLKIT"]
["FLOC_TOT_D","Value","Storage Tank","CV_STRTNK"]
["FLOC_TOT_D","Value","Toilet","CV_TOILET"]
["FLOC_TOT_D","Value","Trench","CV_TRNH"]
["FLOC_TOT_D","Value","Trench Cover","CV_TRNHCO"]
["FLOC_TOT_D","Value","Vehicle Access Gate","CV_VHGATE"]
["FLOC_TOT_D","Value","Water Pump Set","CV_WPUMP"]
["FLOC_TOT_D","Value","Washbay","CV_WSHBAY"]
["FLOC_TOT_D","Value","Water Storage Tank","CV_WSTTNK"]
["FLOC_TOT_D","Value","Water Supply","CV_WTSPLY"]
["FLOC_TOT_D","Value","Yard Area","CV_YARD"]
["FLOC_TOT_D","Value","Combination Sw Stn","DG_CMBSWS"]
["FLOC_TOT_D","Value","Direct Con - LV - GD","DG_DCLVGD"]
["FLOC_TOT_D","Value","Dist Earth Switch","DG_ERSWD"]
["FLOC_TOT_D","Value","DSUB Monitor","DM_SUBMON"]
["FLOC_TOT_D","Value","Regulating Pole Sub","DS_RPLSUB"]
["FLOC_TOT_D","Value","SWER Isolating Sub","DS_SWERIS"]
["FLOC_TOT_D","Value","Earth Grid","ER_ERGRID"]
["FLOC_TOT_D","Value","Portable Earth","ER_ERPORT"]
["FLOC_TOT_D","Value","Fire Blankets - Gel","FE_FBLGEL"]
["FLOC_TOT_D","Value","Fire Door - Sliding","FE_FDRSLD"]
["FLOC_TOT_D","Value","Fire Door - Standard","FE_FDRSTD"]
["FLOC_TOT_D","Value","Fire Extinguisher","FE_FEXTGH"]
["FLOC_TOT_D","Value","Fire Pump Set","FE_FPUMP"]
["FLOC_TOT_D","Value","Fire Storage Tank","FE_FSTTNK"]
["FLOC_TOT_D","Value","Fire/Water Equipment","FE_FWEQ"]
["FLOC_TOT_D","Value","Hose Reel","FE_HOSERL"]
["FLOC_TOT_D","Value","Fire Hydrant","FE_HYDRNT"]
["FLOC_TOT_D","Value","Sprinkler Valve Sys","FE_SPRKLV"]
["FLOC_TOT_D","Value","Generator Facility","GN_GENRTR"]
["FLOC_TOT_D","Value","Anchor Point","HS_ANCPNT"]
["FLOC_TOT_D","Value","Fall Arrestor","HS_FALART"]
["FLOC_TOT_D","Value","Harness and Lanyard","HS_HARNES"]
["FLOC_TOT_D","Value","Hardware Server","HW_SERVER"]
["FLOC_TOT_D","Value","Lift Personnel","LF_LIFT"]
["FLOC_TOT_D","Value","Cylinder Lock","LK_CYLNLK"]
["FLOC_TOT_D","Value","Padlock","LK_PADLK"]
["FLOC_TOT_D","Value","Pole Map","MP_POLEMP"]
["FLOC_TOT_D","Value","Streetlight Map","MP_SLGTMP"]
["FLOC_TOT_D","Value","Vegetation Map","MP_VEGEMP"]
["FLOC_TOT_D","Value","HV Overhead Assembly","OH_HVASSM"]
["FLOC_TOT_D","Value","LV Overhead Assembly","OH_LVASSM"]
["FLOC_TOT_D","Value","TR Overhead Assembly","OH_TRASSM"]
["FLOC_TOT_D","Value","Composite Fibre Pole","PL_CMPFPL"]
["FLOC_TOT_D","Value","Concrete Pole","PL_CONPL"]
["FLOC_TOT_D","Value","Steel Pole","PL_STLPL"]
["FLOC_TOT_D","Value","Wood Pole","PL_WOODPL"]
["FLOC_TOT_D","Value","AUX & Tripping Relay","PR_AUXTPR"]
["FLOC_TOT_D","Value","Busbar Prot Relay","PR_BUSPR"]
["FLOC_TOT_D","Value","Distance Prot Relay","PR_DISTPR"]
["FLOC_TOT_D","Value","Feeder Diff Relay","PR_FDDFPR"]
["FLOC_TOT_D","Value","Knife Switch - LV","DG_KNFLV"]
["FLOC_TOT_D","Value","LV Switchgear","DG_LVSWGR"]
["FLOC_TOT_D","Value","Steel Encl Swbd - LV","DG_SSWBLV"]
["FLOC_TOT_D","Value","HV Switch/Fuse Unit","DG_SWFUNT"]
["FLOC_TOT_D","Value","Sw Load Break - LV","DG_SWLBLV"]
["FLOC_TOT_D","Value","HV Switch Unit","DG_SWUNT"]
["FLOC_TOT_D","Value","Cubicle Swtchng Stn","DS_CUBSW"]
["FLOC_TOT_D","Value","Indoor Swtchng Stn","DS_INDSW"]
["FLOC_TOT_D","Value","Single Pole Sub","DS_PLSUB"]
["FLOC_TOT_D","Value","Emergency Exit Light","FE_EMEXLT"]
["FLOC_TOT_D","Value","Fire Alarm Detector","FE_FALRMD"]
["FLOC_TOT_D","Value","Fire Alarm Panel","FE_FALRMP"]
["FLOC_TOT_D","Value","Fire Blankets - Dry","FE_FBLDRY"]
["FLOC_TOT_D","Value","Fire Damper HVAC","FE_FDHVAC"]
["FLOC_TOT_D","Value","Fire Shutters/Vent","FE_FSHVNT"]
["FLOC_TOT_D","Value","Gas Suppression Sys","FE_GASSSY"]
["FLOC_TOT_D","Value","LV Pillar Box","LP_PILBOX"]
["FLOC_TOT_D","Value","LV Pillar Cubicle","LP_PILCUB"]
["FLOC_TOT_D","Value","Pilot Termination","OH_PCTE"]
["FLOC_TOT_D","Value","UG/OH Termination","OH_UGOH"]
["FLOC_TOT_D","Value","Max Demand Indicator","SE_MDI"]
["FLOC_TOT_D","Value","Streetlight Ctrl Pt","SL_CTRLPT"]
["FLOC_TOT_D","Value","Air Break Switch","SW_ABS"]
["FLOC_TOT_D","Value","Load Break Switch","SW_LBS"]
["FLOC_TOT_D","Value","Link","SW_LINK"]
["FLOC_TOT_D","Value","Link/Fuse","SW_LINKF"]
["FLOC_TOT_D","Value","LV Links","SW_LVLINK"]
["FLOC_TOT_D","Value","Recloser","SW_RECL"]
["FLOC_TOT_D","Value","Sectionaliser","SW_SECT"]
["FLOC_TOT_D","Value","Under Slung Link","SW_USL"]
["FLOC_TOT_D","Value","Optus Asset","TP_OPTUS"]
["FLOC_TOT_D","Value","Third Party Asset","TP_OTHER"]
["FLOC_TOT_D","Value","RMS Traffic Signals","TP_RMSTCS"]
["FLOC_TOT_D","Value","Telstra Asset","TP_TELSTR"]
["FLOC_TOT_D","Value","Building Modular","CV_BLDGMD"]
["FLOC_TOT_D","Value","Coupling Cell Cap","AF_CPLCAP"]
["FLOC_TOT_D","Value","Coupling Cell Coils","AF_CPLCL"]
["FLOC_TOT_D","Value","Motor Generator Set","AF_MTRGEN"]
["FLOC_TOT_D","Value","Static Freq Unit","AF_SFU"]
["FLOC_TOT_D","Value","Supervision Unit","AF_SVU"]
["FLOC_TOT_D","Value","Aerial Marker Ball","AM_AMBALL"]
["FLOC_TOT_D","Value","Artwork","AR_ARTWRK"]
["FLOC_TOT_D","Value","Accs Trk Entry Point","AT_ENTYPT"]
["FLOC_TOT_D","Value","Vhcle Accs Trk Gte","AT_VHACGT"]
["FLOC_TOT_D","Value","Acc Trk Water Cross","AT_VHWYCR"]
["FLOC_TOT_D","Value","Automatic Doors","BF_ATDOOR"]
["FLOC_TOT_D","Value","Roller Shutter Doors","BF_SHUTTR"]
["FLOC_TOT_D","Value","AFIC Bay","BY_AFBY"]
["FLOC_TOT_D","Value","Busbar Bay","BY_BRBY"]
["FLOC_TOT_D","Value","Battery Bay","BY_BTBY"]
["FLOC_TOT_D","Value","Feeder Bay","BY_FDBY"]
["FLOC_TOT_D","Value","Overhead Bay","BY_OHBAY"]
["FLOC_TOT_D","Value","Transformer Bay","BY_TXBY"]
["FLOC_TOT_D","Value","Circuit breaker - HV","CB_CBHV"]
["FLOC_TOT_D","Value","Circuit breaker - LV","CB_CBLV"]
["FLOC_TOT_D","Value","CB - LV - PL","CB_CBLVPL"]
["FLOC_TOT_D","Value","Dead Tank CB","CB_DTKCB"]
["FLOC_TOT_D","Value","Live Tank CB","CB_LTKCB"]
["FLOC_TOT_D","Value","Recloser CB","CB_RECLCB"]
["FLOC_TOT_D","Value","CB Truck","CB_TRUKCB"]
["FLOC_TOT_D","Value","Transmission Zone CB","CB_TSZSCB"]
["FLOC_TOT_D","Value","Bain Marie","CE_BAINMA"]
["FLOC_TOT_D","Value","BBQ","CE_BBQ"]
["FLOC_TOT_D","Value","Boiling Water Unit","CE_BOILWT"]
["FLOC_TOT_D","Value","Bratt Pan","CE_BRATTP"]
["FLOC_TOT_D","Value","Coolroom Freezer","CE_CRFRZR"]
["FLOC_TOT_D","Value","Coolroom Refridgertr","CE_CRREFD"]
["FLOC_TOT_D","Value","Deep Fryer","CE_DFRYER"]
["FLOC_TOT_D","Value","Grill","CE_GRILL"]
["FLOC_TOT_D","Value","Ice Machine","CE_ICEMCH"]
["FLOC_TOT_D","Value","Oven","CE_OVEN"]
["FLOC_TOT_D","Value","Plate Warmer","CE_PLWARM"]
["FLOC_TOT_D","Value","Salamander","CE_SLMNDR"]
["FLOC_TOT_D","Value","Stove","CE_STOVE"]
["FLOC_TOT_D","Value","Vending Machine","CE_VENDMA"]
["FLOC_TOT_D","Value","Fuel and Chemicals","CH_FLCHEM"]
["FLOC_TOT_D","Value","Gas Bottle","CH_GASBOT"]
["FLOC_TOT_D","Value","Fuel Tank","CH_TNKFUL"]
["FLOC_TOT_D","Value","Column Concrete (SL)","CL_CNSLCL"]
["FLOC_TOT_D","Value","Column Steel (LV)","CL_STLVCL"]
["FLOC_TOT_D","Value","Column Steel (SL)","CL_STSLCL"]
["FLOC_TOT_D","Value","Communications Equip","CM_CMEQUP"]
["FLOC_TOT_D","Value","Communications Site","CM_CMSITE"]
["FLOC_TOT_D","Value","3G/4G Modem","CM_MODEMM"]
["FLOC_TOT_D","Value","Switch Controller","CM_SWCTRL"]
["FLOC_TOT_D","Value","Switch Radio","CM_SWRAD"]
["FLOC_TOT_D","Value","Crane - Bridge","CN_BRDGCN"]
["FLOC_TOT_D","Value","Crane - Gantry","CN_GNTYCN"]
["FLOC_TOT_D","Value","Crane - Jib","CN_JIBCN"]
["FLOC_TOT_D","Value","Crane - Portal","CN_PRTLCN"]
["FLOC_TOT_D","Value","Core Balance CT","CT_CRBLCT"]
["FLOC_TOT_D","Value","Epoxy CT","CT_EPXYCT"]
["FLOC_TOT_D","Value","Integrated CT","CT_INTCT"]
["FLOC_TOT_D","Value","Metering CT","CT_MTRCT"]
["FLOC_TOT_D","Value","Neutral Earth CT","CT_NERCT"]
["FLOC_TOT_D","Value","Neutral Unbalance CT","CT_NUBCT"]
["FLOC_TOT_D","Value","Post CT","CT_POSTCT"]
["FLOC_TOT_D","Value","Indoor Capacitor","CU_INCAP"]
["FLOC_TOT_D","Value","Outdoor Capacitor","CU_ODCAP"]
["FLOC_TOT_D","Value","Outdoor Enclosed Cap","CU_ODECAP"]
["FLOC_TOT_D","Value","Air Conditioner","CV_AIRCON"]
["FLOC_TOT_D","Value","Bathroom","CV_BATHRM"]
["FLOC_TOT_D","Value","Building Store","CV_BLDGST"]
["FLOC_TOT_D","Value","Bund Wall","CV_BNDWLL"]
["FLOC_TOT_D","Value","Brick Enclosure","CV_BRKENC"]
["FLOC_TOT_D","Value","Staff Carpark","CV_CARPRK"]
["FLOC_TOT_D","Value","Catering Section","CV_CATRNG"]
["FLOC_TOT_D","Value","Chain Wire Enclosure","CV_CHNFNC"]
["FLOC_TOT_D","Value","Composite Cubicle","CV_CMPCUB"]
["FLOC_TOT_D","Value","Corridor","CV_CORDRM"]
["FLOC_TOT_D","Value","Foyer","CV_FOYRRM"]
["FLOC_TOT_D","Value","General Area","CV_GENRRM"]
["FLOC_TOT_D","Value","Kitchenette","CV_KITCRM"]
["FLOC_TOT_D","Value","LV Rescue Kit","CV_LVRESK"]
["FLOC_TOT_D","Value","Meeting Room","CV_MEETRM"]
["FLOC_TOT_D","Value","Office","CV_OFFCRM"]
["FLOC_TOT_D","Value","Outdoor Lunch Area","CV_OUTLNC"]
["FLOC_TOT_D","Value","RCDs","CV_RCD"]
["FLOC_TOT_D","Value","Roof Access System","CV_RFACSY"]
["FLOC_TOT_D","Value","Steel Cubicle","CV_STLCUB"]
["FLOC_TOT_D","Value","Cleaner Store Room","CV_STORRM"]
["FLOC_TOT_D","Value","Switch Yard","CV_SWYD"]
["FLOC_TOT_D","Value","Pit Trans/Zone Sub","CV_TSPIT"]
["FLOC_TOT_D","Value","DangerousGoods Store","DA_DNGSTR"]
["FLOC_TOT_D","Value","Direct Con - LV - PL","DG_DCLVPL"]
["FLOC_TOT_D","Value","Generator Link - LV","DG_GENLK"]
["FLOC_TOT_D","Value","HV Busbar","DG_HVBUSB"]
["FLOC_TOT_D","Value","LV Busbar","DG_LVBUSB"]
["FLOC_TOT_D","Value","Switch Fuse - LV","DG_SWFSLV"]
["FLOC_TOT_D","Value","Sw Fuse - LV - PL","DG_SWFSPL"]
["FLOC_TOT_D","Value","Central Logistic Fac","DP_CLF"]
["FLOC_TOT_D","Value","Communications Hut","DP_CMH"]
["FLOC_TOT_D","Value","Field Service Centre","DP_FSC"]
["FLOC_TOT_D","Value","Office Location","DP_OFFICE"]
["FLOC_TOT_D","Value","Tech Training Centre","DP_TTC"]
["FLOC_TOT_D","Value","Cottage Substation","DS_COTSUB"]
["FLOC_TOT_D","Value","Ground Substation","DS_GNDSUB"]
["FLOC_TOT_D","Value","Private Sub/HVC","DS_HVCSUB"]
["FLOC_TOT_D","Value","Indoor Substation","DS_INDSUB"]
["FLOC_TOT_D","Value","Kiosk Substation","DS_KSKSUB"]
["FLOC_TOT_D","Value","Padmount Substation","DS_PADSUB"]
["FLOC_TOT_D","Value","Regulating Sub - GD","DS_REGSUB"]
["FLOC_TOT_D","Value","SWER Substation","DS_SWERSB"]
["FLOC_TOT_D","Value","First Aid Defibrlltr","FA_DEFIB"]
["FLOC_TOT_D","Value","CCP","FD_CCP"]
["FLOC_TOT_D","Value","CCP High Voltage Cus","FD_CCPHVC"]
["FLOC_TOT_D","Value","Property Sub Lease","PY_SUBLEA"]
["FLOC_TOT_D","Value","CCP Unmetered Supply","FD_CCPUMS"]
["FLOC_TOT_D","Value","Dist Earth Wire","FD_FEEDDE"]
["FLOC_TOT_D","Value","Feeder","FD_FEEDER"]
["FLOC_TOT_D","Value","Earth Wire","FD_FEEDEW"]
["FLOC_TOT_D","Value","Pilot Wire","FD_FEEDPI"]
["FLOC_TOT_D","Value","Isolatable Section","FD_ISOSEC"]
["FLOC_TOT_D","Value","OH Consumer Mains","FD_OHCONM"]
["FLOC_TOT_D","Value","Dist OH EarthWire CS","FD_OHCSDE"]
["FLOC_TOT_D","Value","OH Conductor Segment","FD_OHCSEG"]
["FLOC_TOT_D","Value","OH Earth Wire CS","FD_OHCSEW"]
["FLOC_TOT_D","Value","OH Cond Segm Pilot","FD_OHCSPI"]
["FLOC_TOT_D","Value","OH Service Line","FD_OHSRVC"]
["FLOC_TOT_D","Value","Point of Attachment","FD_POA"]
["FLOC_TOT_D","Value","UG Consumer Mains","FD_UGCONM"]
["FLOC_TOT_D","Value","Dist UG EarthWire CS","FD_UGCSDE"]
["FLOC_TOT_D","Value","UG Conductor Segment","FD_UGCSEG"]
["FLOC_TOT_D","Value","UG Earth Wire CS","FD_UGCSEW"]
["FLOC_TOT_D","Value","UG Cond Seg Pilot","FD_UGCSPI"]
["FLOC_TOT_D","Value","UG Service Line","FD_UGSRVC"]
["FLOC_TOT_D","Value","Fire Indicator Panel","FE_FIP"]
["FLOC_TOT_D","Value","Smoke Hutch","FE_SMHTCH"]
["FLOC_TOT_D","Value","VESDA","FE_VESDA"]
["FLOC_TOT_D","Value","Line Fault Indicator","FI_LFI"]
["FLOC_TOT_D","Value","Car","FL_CR"]
["FLOC_TOT_D","Value","ElevatedWork Platfom","FL_EWP"]
["FLOC_TOT_D","Value","Light Commercial","FL_LC"]
["FLOC_TOT_D","Value","Crane Borer","FL_PB"]
["FLOC_TOT_D","Value","VehicleLoading Crane","FL_PC"]
["FLOC_TOT_D","Value","Forklift","FL_PF"]
["FLOC_TOT_D","Value","Trailer","FL_PT"]
["FLOC_TOT_D","Value","Cable Winch","FL_PW"]
["FLOC_TOT_D","Value","Specialised Plant","FL_PX"]
["FLOC_TOT_D","Value","Truck","FL_TR"]
["FLOC_TOT_D","Value","Vehicle Telematics","FL_VEHTEL"]
["FLOC_TOT_D","Value","UG Termination","GD_UGTERM"]
["FLOC_TOT_D","Value","Generator","GN_GENATR"]
["FLOC_TOT_D","Value","Property Sub Licence","PY_SUBLIC"]
["FLOC_TOT_D","Value","HVAC Air Con Pump","HC_ACPUMP"]
["FLOC_TOT_D","Value","HVAC Air Handlng Unt","HC_AHU"]
["FLOC_TOT_D","Value","HVAC Chiller","HC_CHILLR"]
["FLOC_TOT_D","Value","HVAC Cooling Tower","HC_CLTOWR"]
["FLOC_TOT_D","Value","HVAC Exhaust Fan","HC_EXHFAN"]
["FLOC_TOT_D","Value","HVAC Fan Coil Unit","HC_FCU"]
["FLOC_TOT_D","Value","HVAC fume Cupboard","HC_FUMECP"]
["FLOC_TOT_D","Value","Hotwater system","HC_HOTWTR"]
["FLOC_TOT_D","Value","HVAC Split System","HC_SPLSYS"]
["FLOC_TOT_D","Value","Height Safety","HS_HEIGHT"]
["FLOC_TOT_D","Value","Ladder and Platform","HS_LADDER"]
["FLOC_TOT_D","Value","Ladder Fixing Point","HS_LADDFP"]
["FLOC_TOT_D","Value","Static Line","HS_STATLN"]
["FLOC_TOT_D","Value","Camera","HW_CAMERA"]
["FLOC_TOT_D","Value","PC Desktop","HW_DESKTP"]
["FLOC_TOT_D","Value","Docking Station","HW_DSTATN"]
["FLOC_TOT_D","Value","Fax Machine","HW_FAX"]
["FLOC_TOT_D","Value","IT Cable","HW_ITCBLE"]
["FLOC_TOT_D","Value","IT Power Supply","HW_ITPSUP"]
["FLOC_TOT_D","Value","PC Laptop","HW_LAPTOP"]
["FLOC_TOT_D","Value","Multiplexer","HW_MLTIPL"]
["FLOC_TOT_D","Value","Mobile Phone","HW_MOBILE"]
["FLOC_TOT_D","Value","Modem","HW_MODEM"]
["FLOC_TOT_D","Value","Monitor","HW_MONITR"]
["FLOC_TOT_D","Value","Mobile Radio","HW_MRADIO"]
["FLOC_TOT_D","Value","Navigator","HW_NAVIGT"]
["FLOC_TOT_D","Value","Network Hub","HW_NETHUB"]
["FLOC_TOT_D","Value","Land Line Phone","HW_PHONLL"]
["FLOC_TOT_D","Value","Printer","HW_PRINTR"]
["FLOC_TOT_D","Value","Router","HW_ROUTR"]
["FLOC_TOT_D","Value","Scada Comms Equip","HW_SCADA"]
["FLOC_TOT_D","Value","Storage Device","HW_SDEVIC"]
["FLOC_TOT_D","Value","Server Rack","HW_SVRRCK"]
["FLOC_TOT_D","Value","Network Switch","HW_SWITCH"]
["FLOC_TOT_D","Value","PC Tablet","HW_TABLET"]
["FLOC_TOT_D","Value","Telephonics","HW_TELEPH"]
["FLOC_TOT_D","Value","Unintrptd Pwr Spply","HW_UPS"]
["FLOC_TOT_D","Value","Moble Wireless Card","HW_WICARD"]
["FLOC_TOT_D","Value","Instrument","IN_INSTMT"]
["FLOC_TOT_D","Value","IT Equipment","IT_ITEQUI"]
["FLOC_TOT_D","Value","Motor Box","MB_MTRBOX"]
["FLOC_TOT_D","Value","Night Watch Bracket","NW_BRKTNW"]
["FLOC_TOT_D","Value","Night Watch Lantern","NW_LTRNNW"]
["FLOC_TOT_D","Value","Night Watch","NW_NGTWCH"]
["FLOC_TOT_D","Value","Earth Wire Assembly","OH_EWIRE"]
["FLOC_TOT_D","Value","OH Conductor Joint","OH_OHJNT"]
["FLOC_TOT_D","Value","OPGW","OH_OPGW"]
["FLOC_TOT_D","Value","Pilot Cable","OH_PILOT"]
["FLOC_TOT_D","Value","Pit","PI_PIT"]
["FLOC_TOT_D","Value","OC/EF/SEF Prot Relay","PR_OCEFPR"]
["FLOC_TOT_D","Value","Trf Auxiliary Relay","PR_TXAXPR"]
["FLOC_TOT_D","Value","Trf Diff Relay","PR_TXDFPR"]
["FLOC_TOT_D","Value","Underfrequency Relay","PR_UFPR"]
["FLOC_TOT_D","Value","Voltage Prot Relay","PR_VOLTPR"]
["FLOC_TOT_D","Value","AFIC Protection","PS_AFICPS"]
["FLOC_TOT_D","Value","AUX Trf Protection","PS_ATRFPS"]
["FLOC_TOT_D","Value","Busbar Protection","PS_BSBRPS"]
["FLOC_TOT_D","Value","Capacitor Protection","PS_CAPPS"]
["FLOC_TOT_D","Value","DSUB Protection","PS_DSUBPS"]
["FLOC_TOT_D","Value","Feeder Protection","PS_FDPS"]
["FLOC_TOT_D","Value","Recloser Protection","PS_RECLPS"]
["FLOC_TOT_D","Value","Trf Protection","PS_TRFPS"]
["FLOC_TOT_D","Value","U/F Load Shed Prot","PS_UFLDPS"]
["FLOC_TOT_D","Value","Easement","PY_ESMNT"]
["FLOC_TOT_D","Value","Property Freehold","PY_FREEHD"]
["FLOC_TOT_D","Value","Property Lease","PY_LEASE"]
["FLOC_TOT_D","Value","Property Licence","PY_LICENC"]
["FLOC_TOT_D","Value","Prop Statutory Right","PY_STATRT"]
["FLOC_TOT_D","Value","OH River Crossing","RC_OHRIV"]
["FLOC_TOT_D","Value","Submarine R Crossing","RC_SUBRIV"]
["FLOC_TOT_D","Value","Cap Dischrge Reactor","RE_CAPDIS"]
["FLOC_TOT_D","Value","Cap Switch Reactor","RE_CAPSW"]
["FLOC_TOT_D","Value","Neutral Erth Reactor","RE_NEREAC"]
["FLOC_TOT_D","Value","Neut Erth Resistor","RE_NERES"]
["FLOC_TOT_D","Value","Damaged Asset","RT_DASSET"]
["FLOC_TOT_D","Value","New Asset","RT_NASSET"]
["FLOC_TOT_D","Value","Recovered Asset","RT_RASSET"]
["FLOC_TOT_D","Value","Scrap Asset","RT_SASSET"]
["FLOC_TOT_D","Value","Rotable Asset Store","RT_STORE"]
["FLOC_TOT_D","Value","Scale","SA_SCALE"]
["FLOC_TOT_D","Value","Main Switch Board","SB_MSB"]
["FLOC_TOT_D","Value","AIM Module","SC_AIM"]
["FLOC_TOT_D","Value","DIM Module","SC_DIM"]
["FLOC_TOT_D","Value","Distributed IO","SC_DISIO"]
["FLOC_TOT_D","Value","Distributed RTU","SC_DISRTU"]
["FLOC_TOT_D","Value","DOM/POM Module","SC_DOMPOM"]
["FLOC_TOT_D","Value","Protocol Gateway","SC_GATEWY"]
["FLOC_TOT_D","Value","GPS","SC_GPS"]
["FLOC_TOT_D","Value","Human-Mach Interface","SC_HMI"]
["FLOC_TOT_D","Value","SCADA LAN Device","SC_LAN"]
["FLOC_TOT_D","Value","Media Converter","SC_MCNVTR"]
["FLOC_TOT_D","Value","Scada Network Switch","SC_NETSW"]
["FLOC_TOT_D","Value","Other Device","SC_OTHDV"]
["FLOC_TOT_D","Value","Cut Down Rack","SC_RACKCU"]
["FLOC_TOT_D","Value","Full Rack","SC_RACKFU"]
["FLOC_TOT_D","Value","Scada Router","SC_ROUTER"]
["FLOC_TOT_D","Value","Remote Terminal Unit","SC_RTU"]
["FLOC_TOT_D","Value","Security Device","SC_SCTYDV"]
["FLOC_TOT_D","Value","Terminal Server","SC_TMLSVR"]
["FLOC_TOT_D","Value","Zac Controller","SC_ZAC"]
["FLOC_TOT_D","Value","Surge Diverters","SE_SRGDIV"]
["FLOC_TOT_D","Value","Helicopter Helmet","SF_HELMET"]
["FLOC_TOT_D","Value","Streetlight Bracket","SL_BRKTSL"]
["FLOC_TOT_D","Value","Streetlight Lantern","SL_LTRNSL"]
["FLOC_TOT_D","Value","Streetlight Outreach","SL_OTRCSL"]
["FLOC_TOT_D","Value","Street Lighting","SL_STLGHT"]
["FLOC_TOT_D","Value","Software","SO_SOFTWR"]
["FLOC_TOT_D","Value","OH Spreader","SP_OHSPRD"]
["FLOC_TOT_D","Value","Security CCTV","SS_CCTV"]
["FLOC_TOT_D","Value","Security Intercomms","SS_INTCOM"]
["FLOC_TOT_D","Value","Safe","SS_SAFE"]
["FLOC_TOT_D","Value","Security System","SS_SECSYS"]
["FLOC_TOT_D","Value","Structure Column","ST_CLMNST"]
["FLOC_TOT_D","Value","Structure LV Pillar","ST_PILLST"]
["FLOC_TOT_D","Value","Pit Structure","ST_PITST"]
["FLOC_TOT_D","Value","Structure Pole","ST_POLEST"]
["FLOC_TOT_D","Value","Structure Tower","ST_TOWRST"]
["FLOC_TOT_D","Value","Drop Out Fuse Pole","SW_DOFPL"]
["FLOC_TOT_D","Value","Drop Out Fuse PL Sub","SW_DOFSUB"]
["FLOC_TOT_D","Value","Fuse Saver","SW_FUSAVR"]
["FLOC_TOT_D","Value","LV Link Box","SW_LVLKBX"]
["FLOC_TOT_D","Value","Tapchanger","TC_TAPCHG"]
["FLOC_TOT_D","Value","Trans Busbar","TE_BUSBAR"]
["FLOC_TOT_D","Value","Changeover Switch","TE_CHGOSW"]
["FLOC_TOT_D","Value","Cap Contactor","TE_CNTCAP"]
["FLOC_TOT_D","Value","Trans Disconnector","TE_DISC"]
["FLOC_TOT_D","Value","Trans Earth Switch","TE_ERSWT"]
["FLOC_TOT_D","Value","Trans Isolator","TE_ISOL"]
["FLOC_TOT_D","Value","Trans Links","TE_LINKS"]
["FLOC_TOT_D","Value","Plug-in Termination","TE_PLUGIN"]
["FLOC_TOT_D","Value","Trans Surge Arrestor","TE_SURGE"]
["FLOC_TOT_D","Value","UG Cable Segment","TE_UGSEG"]
["FLOC_TOT_D","Value","Wall Bushing","TE_WLBUSH"]
["FLOC_TOT_D","Value","Tool Electrc Powered","TO_ELEC"]
["FLOC_TOT_D","Value","Hand Tools","TO_HAND"]
["FLOC_TOT_D","Value","Tool Hydraulic Powrd","TO_HYDRLC"]
["FLOC_TOT_D","Value","Miscellaneous Tool","TO_MISCTL"]
["FLOC_TOT_D","Value","Tool Petrol Powered","TO_PETROL"]
["FLOC_TOT_D","Value","Tools Pneumatic Pwrd","TO_PNEUMT"]
["FLOC_TOT_D","Value","Tools Portable Earth","TO_PORERT"]
["FLOC_TOT_D","Value","Portable Ladder","TO_PORTLD"]
["FLOC_TOT_D","Value","Pressure Washer","TO_PRWSHR"]
["FLOC_TOT_D","Value","Tool Battery Powered","TO_TBATT"]
["FLOC_TOT_D","Value","NBN Asset","TP_NBN"]
["FLOC_TOT_D","Value","Tower","TW_TOWER"]
["FLOC_TOT_D","Value","Auto Transformer","TX_AUTOTX"]
["FLOC_TOT_D","Value","Auxiliary Trf","TX_AUXTX"]
["FLOC_TOT_D","Value","Cable Entry Trf","TX_CABETX"]
["FLOC_TOT_D","Value","Earthing Transformer","TX_ERTHTX"]
["FLOC_TOT_D","Value","Free Standing Trf","TX_FSTDTX"]
["FLOC_TOT_D","Value","Ground Mounted Trf","TX_GDMTTX"]
["FLOC_TOT_D","Value","Isolation Trf","TX_ISOLTX"]
["FLOC_TOT_D","Value","Kiosk Transformer","TX_KSKTX"]
["FLOC_TOT_D","Value","Padmount Transformer","TX_PADTX"]
["FLOC_TOT_D","Value","Platform Transformer","TX_PLFMTX"]
["FLOC_TOT_D","Value","Pole Mounted Trf","TX_PLMTTX"]
["FLOC_TOT_D","Value","Power Transformer","TX_PWRTX"]
["FLOC_TOT_D","Value","Voltage Reg Trf","TX_VREGTX"]
["FLOC_TOT_D","Value","Bulk Supply Point","TZ_BSP"]
["FLOC_TOT_D","Value","HVC Substation","TZ_HVC"]
["FLOC_TOT_D","Value","Switching Station","TZ_SS"]
["FLOC_TOT_D","Value","Trans Substation","TZ_TS"]
["FLOC_TOT_D","Value","Zone Substation","TZ_ZS"]
["FLOC_TOT_D","Value","UG Cable Joint","UG_UGJNT"]
["FLOC_TOT_D","Value","UG Cable Node","UG_UGNODE"]
["FLOC_TOT_D","Value","Undergrnd Duct Route","UG_UGROUT"]
["FLOC_TOT_D","Value","Vibration Damper","VD_VIBDAM"]
["FLOC_TOT_D","Value","Press Vess Air Rcvr","VP_ARECVR"]
["FLOC_TOT_D","Value","Air Compressor","VP_COMPRS"]
["FLOC_TOT_D","Value","Hydraulic Accumulatr","VP_HYRACC"]
["FLOC_TOT_D","Value","Pressure Vessels","VP_PRSVES"]
["FLOC_TOT_D","Value","3 Phase Magnetic VT","VT_3PHVT"]
["FLOC_TOT_D","Value","Post Capacitor VT","VT_CAPVT"]
["FLOC_TOT_D","Value","Metering (CCT) VT","VT_CCTVT"]
["FLOC_TOT_D","Value","Integrated VT","VT_INTVT"]
["FLOC_TOT_D","Value","Network VT","VT_NETVT"]
["FLOC_TOT_D","Value","Post Magnetic VT","VT_POSTVT"]
["FLOC_TOT_D","Value","VT Primary Fuse","VT_PRIMFS"]
["FLOC_TOT_D","Value","VT Primary Link","VT_PRIMLK"]
["FLOC_TOT_D","Value","Rackable Magnetic VT","VT_RACKVT"]
["FLOC_TOT_D","Value","VT Secondary Fuse","VT_SECFS"]
["FLOC_TOT_D","Value","GRN Radio","TO_GRNRAD"]
["FLOC_TOT_D","Value","RefrigUnitCommercial","CE_FRIDGE"]
["FLOC_TOT_D","Value","Fuel Filter","CH_FILTER"]
["FLOC_TOT_D","Value","Fuel Pump","CH_FULPMP"]
["FLOC_TOT_D","Value","Fuel Leak Detector","CH_LEAKDT"]
["FLOC_TOT_D","Value","Vehicle Hoist","CN_VHOIST"]
["FLOC_TOT_D","Value","FilterWaterTreatment","CV_FILTWT"]
["FLOC_TOT_D","Value","Flow Meter Hydraulic","CV_FLOWMH"]
["FLOC_TOT_D","Value","Macerator","CV_MACER"]
["FLOC_TOT_D","Value","Pump Control Board","CV_PCTLBD"]
["FLOC_TOT_D","Value","Stormwater Retention","CV_STWRET"]
["FLOC_TOT_D","Value","Truck ExhstExtravtor","CV_TEXHXT"]
["FLOC_TOT_D","Value","ThermostMixing Valve","CV_THMIXV"]
["FLOC_TOT_D","Value","Valve","CV_VALVE"]
["FLOC_TOT_D","Value","Auto Transfer Switch","GN_AUTTSW"]
["FLOC_TOT_D","Value","Load Bank","GN_LDBANK"]
["FLOC_TOT_D","Value","StaticTransSwitchSTS","GN_STS"]
["FLOC_TOT_D","Value","Outside Air Fan","HC_OAIRFN"]
["FLOC_TOT_D","Value","Supply Air Fan","HC_SAIRFN"]
["FLOC_TOT_D","Value","VarAirVolume Box VAV","HC_VAV"]
["FLOC_TOT_D","Value","VarRefrigVolBox VRV","HC_VRV"]
["FLOC_TOT_D","Value","Var Speed Drive VSD","HC_VSD"]
["FLOC_TOT_D","Value","Switchboard Distrib","SB_DISTSB"]
["FLOC_TOT_D","Value","Switchboard Mech","SB_MECHSB"]
["FLOC_TOT_D","Value","Solar Panels","SB_SOLPNL"]
["FLOC_TOT_D","Value","Surge Protect Device","SB_SURGDV"]
["FLOC_TOT_D","Value","Drying Cabinet","TO_DRYCAB"]
["FLOC_TOT_D","Value","CPU or Comms Module","SC_CPU"]
["FLOC_TOT_D","Value","HMI Computer","SC_HMIPC"]
["FLOC_TOT_D","Value","HMI Screen","SC_HMISCR"]
["FLOC_TOT_D","Value","Unintrptd PwrSup Lrg","UP_UPS"]
["FLOC_TOT_D","Value","Chemical Dosing Faci","HC_PUMPST"]
["FLOC_TOT_D","Value","CCP Main Switchboard","FD_CCPMSB"]
["FLOC_TOT_D","Value","Crane - Gantry - ZS","CN_CRNGNT"]
["FLOC_TOT_D","Value","HVAC Casstte AirCon","HC_ACCASS"]
["FLOC_TOT_D","Value","HVAC Ducted AirCon","HC_ACDUCT"]
["FLOC_TOT_D","Value","HVAC Cmptr Rm AirCon","HC_CRAC"]
["FLOC_TOT_D","Value","Heat Vntltn & AirCon","HC_HVAC"]
["FLOC_TOT_D","Value","Column & Pillar Map","MP_CLLPMP"]
["FLOC_TOT_D","Value","VT Switch","VT_VTSW"]
["FLOC_TOT_D","Value","Pump Set","CV_PUMPST"]
["FLOC_TOT_D","Value","Auto Trf Substation","DS_ATSUB"]
["FLOC_TOT_D","Value","Auto Trf Pole Sub","DS_ATSUBPL"]
["FLOC_TOT_D","Value","HVAC AirCooled CondU","HC_AIRCCU"]
["FLOC_TOT_D","Value","Chassis/Rack","SC_CHASS"]
["FLOC_TOT_D","Value","Input Module","SC_INPM"]
["FLOC_TOT_D","Value","RTU Peripheral","SC_PERI"]
["FLOC_TOT_D","Value","Power Supply","SC_PSU"]
["FLOC_TOT_D","Value","Isolation Trf AFIC","TX_ISTXAF"]
["FLOC_TOT_D","Value","AC Control Panel","CP_ACCTRL"]
["FLOC_TOT_D","Value","DC Control Panel","CP_DCCTRL"]
["FLOC_TOT_D","Value","Gross Pollutant Tank","CV_GRPTK"]
["FLOC_TOT_D","Value","Fibre Pit","FB_PITFIB"]
["FLOC_TOT_D","Value","Fire Hyd Boost Valve","FE_FHYDBT"]
["FLOC_TOT_D","Value","Generator TR Sub Aux","GN_GENTR"]
["FLOC_TOT_D","Value","Link Cable Box","LB_LNKBOX"]
["FLOC_TOT_D","Value","Oil Gauge","OL_OILGA"]
["FLOC_TOT_D","Value","Oil Pit","OL_OILPIT"]
["FLOC_TOT_D","Value","Oil Tank","OL_OILTK"]
["FLOC_TOT_D","Value","Current Reactor","RE_CURR"]
["FLOC_TOT_D","Value","Fault Thrower","TE_FLTCB"]
["FLOC_TOT_D","Value","Trans Switchboard","TE_SWITB"]
["FLOC_TOT_D","Value","Structure Link Cable","ST_LKBXST"]
["FLOC_TOT_D","Value","Structure Fibre Pit","ST_PITFST"]
["FLOC_TOT_D","Value","Structure Oil Pit","ST_PITOST"]
["FLOC_TOT_D","Value","NetwCommunityBattery","BT_NETBATT"]
["FLOC_TOT_D","Value","Early fault detector","FI_EFD"]
["FLOC_TOT_D","Value","Drone & Accessories","HW_DRONE"]
["FLOC_TOT_D","Value","LV BATTERY","BT_LVBATT"]
["FLOC_TOT_D","Value","AV Equipment","HW_AVE"]
["FLOC_TOT_D","Value","LV STATCOM","PQ_LVSTCM"]
["FLOC_TOT_D","Value","Batt Ground Struct","BT_GRNDSTR"]
["FLOC_TOT_D","Value","Battery Pole Struct","BT_POLESTR"]
["FLOC_TOT_D","Value","STATCOM Pole Struct","PQ_POLESTR"]
["FLOC_TOT_D","Value","CB Isolation","SW_CBIS"]
["FLOC_TOT_D","Value","Fuse Isolation OH","SW_OHFSIS"]
["FLOC_TOT_D","Value","Switch Isolation OH","SW_OHSWIS"]
["FLOC_TOT_D","Value","Fuse Isolation UG","SW_UGFSIS"]
["FLOC_TOT_D","Value","Switch Isolation UG","SW_UGSWIS"]
["FLOC_TOT_D","Value","Streetlight SmartNod","SL_SMTNOD"]
["MANUCOUNT","Header","Description","Code"]
["MANUCOUNT","Value","Andorra","AD"]
["MANUCOUNT","Value","Utd.Arab Emir.","AE"]
["MANUCOUNT","Value","Afghanistan","AF"]
["MANUCOUNT","Value","Antigua/Barbuda","AG"]
["MANUCOUNT","Value","Anguilla","AI"]
["MANUCOUNT","Value","Albania","AL"]
["MANUCOUNT","Value","Armenia","AM"]
["MANUCOUNT","Value","Angola","AO"]
["MANUCOUNT","Value","Antarctica","AQ"]
["MANUCOUNT","Value","Argentina","AR"]
["MANUCOUNT","Value","Samoa, America","AS"]
["MANUCOUNT","Value","Austria","AT"]
["MANUCOUNT","Value","Australia","AU"]
["MANUCOUNT","Value","Aruba","AW"]
["MANUCOUNT","Value","Aland Islands","AX"]
["MANUCOUNT","Value","Azerbaijan","AZ"]
["MANUCOUNT","Value","Bosnia-Herz.","BA"]
["MANUCOUNT","Value","Barbados","BB"]
["MANUCOUNT","Value","Bangladesh","BD"]
["MANUCOUNT","Value","Belgium","BE"]
["MANUCOUNT","Value","Burkina Faso","BF"]
["MANUCOUNT","Value","Bulgaria","BG"]
["MANUCOUNT","Value","Bahrain","BH"]
["MANUCOUNT","Value","Burundi","BI"]
["MANUCOUNT","Value","Benin","BJ"]
["MANUCOUNT","Value","St. Barthelemy","BL"]
["MANUCOUNT","Value","Bermuda","BM"]
["MANUCOUNT","Value","Brunei Daruss.","BN"]
["MANUCOUNT","Value","Bolivia","BO"]
["MANUCOUNT","Value","Bonaire, Saba","BQ"]
["MANUCOUNT","Value","Brazil","BR"]
["MANUCOUNT","Value","Bahamas","BS"]
["MANUCOUNT","Value","Bhutan","BT"]
["MANUCOUNT","Value","Bouvet Islands","BV"]
["MANUCOUNT","Value","Botswana","BW"]
["MANUCOUNT","Value","Belarus","BY"]
["MANUCOUNT","Value","Belize","BZ"]
["MANUCOUNT","Value","Canada","CA"]
["MANUCOUNT","Value","Keeling Islands","CC"]
["MANUCOUNT","Value","Dem. Rep. Congo","CD"]
["MANUCOUNT","Value","CAR","CF"]
["MANUCOUNT","Value","Rep.of Congo","CG"]
["MANUCOUNT","Value","Switzerland","CH"]
["MANUCOUNT","Value","Cote d'Ivoire","CI"]
["MANUCOUNT","Value","Cook Islands","CK"]
["MANUCOUNT","Value","Chile","CL"]
["MANUCOUNT","Value","Cameroon","CM"]
["MANUCOUNT","Value","China","CN"]
["MANUCOUNT","Value","Colombia","CO"]
["MANUCOUNT","Value","Costa Rica","CR"]
["MANUCOUNT","Value","Cuba","CU"]
["MANUCOUNT","Value","Cape Verde","CV"]
["MANUCOUNT","Value","Curacao","CW"]
["MANUCOUNT","Value","Christmas Islnd","CX"]
["MANUCOUNT","Value","Cyprus","CY"]
["MANUCOUNT","Value","Czech Republic","CZ"]
["MANUCOUNT","Value","Germany","DE"]
["MANUCOUNT","Value","Djibouti","DJ"]
["MANUCOUNT","Value","Denmark","DK"]
["MANUCOUNT","Value","Dominica","DM"]
["MANUCOUNT","Value","Dominican Rep.","DO"]
["MANUCOUNT","Value","Algeria","DZ"]
["MANUCOUNT","Value","Ecuador","EC"]
["MANUCOUNT","Value","Estonia","EE"]
["MANUCOUNT","Value","Egypt","EG"]
["MANUCOUNT","Value","West Sahara","EH"]
["MANUCOUNT","Value","Eritrea","ER"]
["MANUCOUNT","Value","Spain","ES"]
["MANUCOUNT","Value","Ethiopia","ET"]
["MANUCOUNT","Value","European Union","EU"]
["MANUCOUNT","Value","Finland","FI"]
["MANUCOUNT","Value","Fiji","FJ"]
["MANUCOUNT","Value","Falkland Islnds","FK"]
["MANUCOUNT","Value","Micronesia","FM"]
["MANUCOUNT","Value","Faroe Islands","FO"]
["MANUCOUNT","Value","France","FR"]
["MANUCOUNT","Value","Gabon","GA"]
["MANUCOUNT","Value","United Kingdom","GB"]
["MANUCOUNT","Value","Grenada","GD"]
["MANUCOUNT","Value","Georgia","GE"]
["MANUCOUNT","Value","French Guayana","GF"]
["MANUCOUNT","Value","Guernsey","GG"]
["MANUCOUNT","Value","Ghana","GH"]
["MANUCOUNT","Value","Gibraltar","GI"]
["MANUCOUNT","Value","Greenland","GL"]
["MANUCOUNT","Value","Gambia","GM"]
["MANUCOUNT","Value","Guinea","GN"]
["MANUCOUNT","Value","Guadeloupe","GP"]
["MANUCOUNT","Value","Equatorial Guin","GQ"]
["MANUCOUNT","Value","Greece","GR"]
["MANUCOUNT","Value","S. Sandwich Ins","GS"]
["MANUCOUNT","Value","Guatemala","GT"]
["MANUCOUNT","Value","Guam","GU"]
["MANUCOUNT","Value","Guinea-Bissau","GW"]
["MANUCOUNT","Value","Guyana","GY"]
["MANUCOUNT","Value","Hong Kong","HK"]
["MANUCOUNT","Value","Heard/McDon.Isl","HM"]
["MANUCOUNT","Value","Honduras","HN"]
["MANUCOUNT","Value","Croatia","HR"]
["MANUCOUNT","Value","Haiti","HT"]
["MANUCOUNT","Value","Hungary","HU"]
["MANUCOUNT","Value","Indonesia","ID"]
["MANUCOUNT","Value","Ireland","IE"]
["MANUCOUNT","Value","Israel","IL"]
["MANUCOUNT","Value","Isle of Man","IM"]
["MANUCOUNT","Value","India","IN"]
["MANUCOUNT","Value","Brit.Ind.Oc.Ter","IO"]
["MANUCOUNT","Value","Iraq","IQ"]
["MANUCOUNT","Value","Iran","IR"]
["MANUCOUNT","Value","Iceland","IS"]
["MANUCOUNT","Value","Italy","IT"]
["MANUCOUNT","Value","Jersey","JE"]
["MANUCOUNT","Value","Jamaica","JM"]
["MANUCOUNT","Value","Jordan","JO"]
["MANUCOUNT","Value","Japan","JP"]
["MANUCOUNT","Value","Kenya","KE"]
["MANUCOUNT","Value","Kyrgyzstan","KG"]
["MANUCOUNT","Value","Cambodia","KH"]
["MANUCOUNT","Value","Kiribati","KI"]
["MANUCOUNT","Value","Comoros","KM"]
["MANUCOUNT","Value","St Kitts&Nevis","KN"]
["MANUCOUNT","Value","North Korea","KP"]
["MANUCOUNT","Value","South Korea","KR"]
["MANUCOUNT","Value","Kuwait","KW"]
["MANUCOUNT","Value","Cayman Islands","KY"]
["MANUCOUNT","Value","Kazakhstan","KZ"]
["MANUCOUNT","Value","Laos","LA"]
["MANUCOUNT","Value","Lebanon","LB"]
["MANUCOUNT","Value","St. Lucia","LC"]
["MANUCOUNT","Value","Liechtenstein","LI"]
["MANUCOUNT","Value","Sri Lanka","LK"]
["MANUCOUNT","Value","Liberia","LR"]
["MANUCOUNT","Value","Lesotho","LS"]
["MANUCOUNT","Value","Lithuania","LT"]
["MANUCOUNT","Value","Luxembourg","LU"]
["MANUCOUNT","Value","Latvia","LV"]
["MANUCOUNT","Value","Libya","LY"]
["MANUCOUNT","Value","Morocco","MA"]
["MANUCOUNT","Value","Monaco","MC"]
["MANUCOUNT","Value","Moldova","MD"]
["MANUCOUNT","Value","Montenegro","ME"]
["MANUCOUNT","Value","St. Martin","MF"]
["MANUCOUNT","Value","Madagascar","MG"]
["MANUCOUNT","Value","Marshall Islnds","MH"]
["MANUCOUNT","Value","North Macedonia","MK"]
["MANUCOUNT","Value","Mali","ML"]
["MANUCOUNT","Value","Burma","MM"]
["MANUCOUNT","Value","Mongolia","MN"]
["MANUCOUNT","Value","Macau","MO"]
["MANUCOUNT","Value","N.Mariana Islnd","MP"]
["MANUCOUNT","Value","Martinique","MQ"]
["MANUCOUNT","Value","Mauritania","MR"]
["MANUCOUNT","Value","Montserrat","MS"]
["MANUCOUNT","Value","Malta","MT"]
["MANUCOUNT","Value","Mauritius","MU"]
["MANUCOUNT","Value","Maldives","MV"]
["MANUCOUNT","Value","Malawi","MW"]
["MANUCOUNT","Value","Mexico","MX"]
["MANUCOUNT","Value","Malaysia","MY"]
["MANUCOUNT","Value","Mozambique","MZ"]
["MANUCOUNT","Value","Namibia","NA"]
["MANUCOUNT","Value","New Caledonia","NC"]
["MANUCOUNT","Value","Niger","NE"]
["MANUCOUNT","Value","Norfolk Islands","NF"]
["MANUCOUNT","Value","Nigeria","NG"]
["MANUCOUNT","Value","Nicaragua","NI"]
["MANUCOUNT","Value","Netherlands","NL"]
["MANUCOUNT","Value","Norway","NO"]
["MANUCOUNT","Value","Nepal","NP"]
["MANUCOUNT","Value","Nauru","NR"]
["MANUCOUNT","Value","NATO","NT"]
["MANUCOUNT","Value","Niue","NU"]
["MANUCOUNT","Value","New Zealand","NZ"]
["MANUCOUNT","Value","Oman","OM"]
["MANUCOUNT","Value","Orange","OR"]
["MANUCOUNT","Value","Panama","PA"]
["MANUCOUNT","Value","Peru","PE"]
["MANUCOUNT","Value","Frenc.Polynesia","PF"]
["MANUCOUNT","Value","Pap. New Guinea","PG"]
["MANUCOUNT","Value","Philippines","PH"]
["MANUCOUNT","Value","Pakistan","PK"]
["MANUCOUNT","Value","Poland","PL"]
["MANUCOUNT","Value","St.Pier,Miquel.","PM"]
["MANUCOUNT","Value","Pitcairn Islnds","PN"]
["MANUCOUNT","Value","Puerto Rico","PR"]
["MANUCOUNT","Value","Palestine","PS"]
["MANUCOUNT","Value","Portugal","PT"]
["MANUCOUNT","Value","Palau","PW"]
["MANUCOUNT","Value","Paraguay","PY"]
["MANUCOUNT","Value","Qatar","QA"]
["MANUCOUNT","Value","Reunion","RE"]
["MANUCOUNT","Value","Romania","RO"]
["MANUCOUNT","Value","Serbia","RS"]
["MANUCOUNT","Value","Russian Fed.","RU"]
["MANUCOUNT","Value","Rwanda","RW"]
["MANUCOUNT","Value","Saudi Arabia","SA"]
["MANUCOUNT","Value","Solomon Islands","SB"]
["MANUCOUNT","Value","Seychelles","SC"]
["MANUCOUNT","Value","Sudan","SD"]
["MANUCOUNT","Value","Sweden","SE"]
["MANUCOUNT","Value","Singapore","SG"]
["MANUCOUNT","Value","Saint Helena","SH"]
["MANUCOUNT","Value","Slovenia","SI"]
["MANUCOUNT","Value","Svalbard","SJ"]
["MANUCOUNT","Value","Slovakia","SK"]
["MANUCOUNT","Value","Sierra Leone","SL"]
["MANUCOUNT","Value","San Marino","SM"]
["MANUCOUNT","Value","Senegal","SN"]
["MANUCOUNT","Value","Somalia","SO"]
["MANUCOUNT","Value","Suriname","SR"]
["MANUCOUNT","Value","South Sudan","SS"]
["MANUCOUNT","Value","S.Tome,Principe","ST"]
["MANUCOUNT","Value","El Salvador","SV"]
["MANUCOUNT","Value","Sint Maarten","SX"]
["MANUCOUNT","Value","Syria","SY"]
["MANUCOUNT","Value","Eswatini","SZ"]
["MANUCOUNT","Value","Turksh Caicosin","TC"]
["MANUCOUNT","Value","Chad","TD"]
["MANUCOUNT","Value","French S.Territ","TF"]
["MANUCOUNT","Value","Togo","TG"]
["MANUCOUNT","Value","Thailand","TH"]
["MANUCOUNT","Value","Tajikistan","TJ"]
["MANUCOUNT","Value","Tokelau Islands","TK"]
["MANUCOUNT","Value","East Timor","TL"]
["MANUCOUNT","Value","Turkmenistan","TM"]
["MANUCOUNT","Value","Tunisia","TN"]
["MANUCOUNT","Value","Tonga","TO"]
["MANUCOUNT","Value","Turkey","TR"]
["MANUCOUNT","Value","Trinidad,Tobago","TT"]
["MANUCOUNT","Value","Tuvalu","TV"]
["MANUCOUNT","Value","Taiwan","TW"]
["MANUCOUNT","Value","Tanzania","TZ"]
["MANUCOUNT","Value","Ukraine","UA"]
["MANUCOUNT","Value","Uganda","UG"]
["MANUCOUNT","Value","Minor Outl.Isl.","UM"]
["MANUCOUNT","Value","United Nations","UN"]
["MANUCOUNT","Value","USA","US"]
["MANUCOUNT","Value","Uruguay","UY"]
["MANUCOUNT","Value","Uzbekistan","UZ"]
["MANUCOUNT","Value","Vatican City","VA"]
["MANUCOUNT","Value","St. Vincent","VC"]
["MANUCOUNT","Value","Venezuela","VE"]
["MANUCOUNT","Value","Brit.Virgin Is.","VG"]
["MANUCOUNT","Value","US Virgin Isl.","VI"]
["MANUCOUNT","Value","Vietnam","VN"]
["MANUCOUNT","Value","Vanuatu","VU"]
["MANUCOUNT","Value","Wallis,Futuna","WF"]
["MANUCOUNT","Value","Samoa","WS"]
["MANUCOUNT","Value","Yemen","YE"]
["MANUCOUNT","Value","Mayotte","YT"]
["MANUCOUNT","Value","South Africa","ZA"]
["MANUCOUNT","Value","Zambia","ZM"]
["MANUCOUNT","Value","Zimbabwe","ZW"]
["MAINTLOC","Header","Description","Code"]
["MAINTLOC","Value","Werk 0001 Standort 0001","0001"]
["MAINTLOC","Value","Central Logistics Facility","1000"]
["MAINTLOC","Value","Head Office Huntingwood","1100"]
["MAINTLOC","Value","Kandos Field Service Centre","1110"]
["MAINTLOC","Value","Katoomba Field Service Centre","1120"]
["MAINTLOC","Value","Kings Park Field ServiceCentre","1130"]
["MAINTLOC","Value","Parramatta Field ServiceCentre","1140"]
["MAINTLOC","Value","PSQ Parramatta","1145"]
["MAINTLOC","Value","Penrith Field Service Centre","1150"]
["MAINTLOC","Value","Penrith Pole Yard","1160"]
["MAINTLOC","Value","Windsor Field Service Centre","1170"]
["MAINTLOC","Value","Bowenfels Field Service Centre","1180"]
["MAINTLOC","Value","Glendenning FieldServiceCentre","1190"]
["MAINTLOC","Value","Hoxton Park FieldServiceCentre","1210"]
["MAINTLOC","Value","Hoxton Park Technical Training","1220"]
["MAINTLOC","Value","Moss Vale Field Service Centre","1230"]
["MAINTLOC","Value","Narellan Field Service Centre","1240"]
["MAINTLOC","Value","Picton Field Service Centre","1250"]
["MAINTLOC","Value","Transformer Workshop","1260"]
["MAINTLOC","Value","Nowra Field Service Centre","1310"]
["MAINTLOC","Value","Shellharbour FieldServiceCentr","1320"]
["MAINTLOC","Value","Springhill Field ServiceCentre","1330"]
["MAINTLOC","Value","Ulladulla Field Service Centre","1340"]
["MAINTLOC","Value","Blacktown Facilities","BTF_01"]
["MAINTLOC","Value","CDC Eastern Creek","CDC_EC01"]
["MAINTLOC","Value","Compressor # 1","YB_3001"]
["MAINTLOC","Value","Compressor # 2","YB_3002"]
["MAINTLOC","Value","Compressor # 3","YB_3003"]
["MAINTLOC","Value","Compressor # 4","YB_3004"]
["MAINTLOC","Value","Air Dryer","YB_3005"]
["MAINTLOC","Value","Cooling Water System","YB_3006"]
["MAINTLOC","Value","Cooling Towers","YB_3007"]
["ABCKZ","Header","Description","Code"]
["ABCKZ","Value","Non Outage Object","N"]
["ABCKZ","Value","Outage Dependant Obj","O"]
["ABCKZ","Value","Unknown Outage Depen","U"]

{"sheet":"SAPMSG","index":6,"n_rows":1,"n_cols":3,"rows_kept":1,"cut":false,"hidden":true,"merged":[]}
["FLOC","MSG_FLOC","MSG_EQ"]

{"sheet":"REFEQUIP","index":7,"n_rows":594,"n_cols":6,"rows_kept":594,"cut":false,"hidden":true,"merged":[]}
["Reference Equipment No","Reference Equipment Desc","Technical Object Type","Technical Object Type Desc"]
["000000001002471714","Gen, 3 Phase Magnetic VT","VT_3PHVT","3 Phase Magnetic VT",{"$f":"IFERROR(VLOOKUP(C2,ELIST!$A$2:$E$300,2,FALSE),0)","v":0},{"$f":"IFERROR(VLOOKUP(C2,ELIST!$A$2:$E$300,5,FALSE),0)","v":0}]
["000000001002471715","3 Phase Magnetic VT Oil Outdoor","VT_3PHVT","3 Phase Magnetic VT",{"$f":"IFERROR(VLOOKUP(C3,ELIST!$A$2:$E$300,2,FALSE),0)","v":0},{"$f":"IFERROR(VLOOKUP(C3,ELIST!$A$2:$E$300,5,FALSE),0)","v":0}]
["000000001002471716","3 Phase Magnetic VT Oil Indoor","VT_3PHVT","3 Phase Magnetic VT",{"$f":"IFERROR(VLOOKUP(C4,ELIST!$A$2:$E$300,2,FALSE),0)","v":0},{"$f":"IFERROR(VLOOKUP(C4,ELIST!$A$2:$E$300,5,FALSE),0)","v":0}]
["000000001002471717","3 Phase Magnetic VT SF6 Outdoor","VT_3PHVT","3 Phase Magnetic VT",{"$f":"IFERROR(VLOOKUP(C5,ELIST!$A$2:$E$300,2,FALSE),0)","v":0},{"$f":"IFERROR(VLOOKUP(C5,ELIST!$A$2:$E$300,5,FALSE),0)","v":0}]
["000000001002471718","3 Phase Magnetic VT SF6 Indoor","VT_3PHVT","3 Phase Magnetic VT",{"$f":"IFERROR(VLOOKUP(C6,ELIST!$A$2:$E$300,2,FALSE),0)","v":0},{"$f":"IFERROR(VLOOKUP(C6,ELIST!$A$2:$E$300,5,FALSE),0)","v":0}]
["000000001002471719","3 Phase Magnetic VT Epoxy Outdoor","VT_3PHVT","3 Phase Magnetic VT",{"$f":"IFERROR(VLOOKUP(C7,ELIST!$A$2:$E$300,2,FALSE),0)","v":0},{"$f":"IFERROR(VLOOKUP(C7,ELIST!$A$2:$E$300,5,FALSE),0)","v":0}]
["000000001002471720","3 Phase Magnetic VT Epoxy Indoor","VT_3PHVT","3 Phase Magnetic VT",{"$f":"IFERROR(VLOOKUP(C8,ELIST!$A$2:$E$300,2,FALSE),0)","v":0},{"$f":"IFERROR(VLOOKUP(C8,ELIST!$A$2:$E$300,5,FALSE),0)","v":0}]
["000000001002471721","3 Phase Magnetic VT GIS Outdoor","VT_3PHVT","3 Phase Magnetic VT",{"$f":"IFERROR(VLOOKUP(C9,ELIST!$A$2:$E$300,2,FALSE),0)","v":0},{"$f":"IFERROR(VLOOKUP(C9,ELIST!$A$2:$E$300,5,FALSE),0)","v":0}]
["000000001002471722","3 Phase Magnetic VT GIS Indoor","VT_3PHVT","3 Phase Magnetic VT",{"$f":"IFERROR(VLOOKUP(C10,ELIST!$A$2:$E$300,2,FALSE),0)","v":0},{"$f":"IFERROR(VLOOKUP(C10,ELIST!$A$2:$E$300,5,FALSE),0)","v":0}]
["000000001002471725","Gen, HVAC Casstte Air Con","HC_ACCASS","HVAC Casstte AirCon",{"$f":"IFERROR(VLOOKUP(C11,ELIST!$A$2:$E$300,2,FALSE),0)","v":0},{"$f":"IFERROR(VLOOKUP(C11,ELIST!$A$2:$E$300,5,FALSE),0)","v":0}]
["000000001002471726","Gen, HVAC Ducted Air Con","HC_ACDUCT","HVAC Ducted AirCon",{"$f":"IFERROR(VLOOKUP(C12,ELIST!$A$2:$E$300,2,FALSE),0)","v":0},{"$f":"IFERROR(VLOOKUP(C12,ELIST!$A$2:$E$300,5,FALSE),0)","v":0}]
["000000001002471727","Gen, HVAC Air Con Pump","HC_ACPUMP","HVAC Air Con Pump",{"$f":"IFERROR(VLOOKUP(C13,ELIST!$A$2:$E$300,2,FALSE),0)","v":0},{"$f":"IFERROR(VLOOKUP(C13,ELIST!$A$2:$E$300,5,FALSE),0)","v":0}]
["000000001002471728","Gen, HVAC Air Handlng Unt","HC_AHU","HVAC Air Handlng Unt",{"$f":"IFERROR(VLOOKUP(C14,ELIST!$A$2:$E$300,2,FALSE),0)","v":0},{"$f":"IFERROR(VLOOKUP(C14,ELIST!$A$2:$E$300,5,FALSE),0)","v":0}]
["000000001002471729","Gen, Air Conditioner","CV_AIRCON","Air Conditioner",{"$f":"IFERROR(VLOOKUP(C15,ELIST!$A$2:$E$300,2,FALSE),0)","v":0},{"$f":"IFERROR(VLOOKUP(C15,ELIST!$A$2:$E$300,5,FALSE),0)","v":0}]
["000000001002471730","Gen, Aerial Marker Ball","AM_AMBALL","Aerial Marker Ball",{"$f":"IFERROR(VLOOKUP(C16,ELIST!$A$2:$E$300,2,FALSE),0)","v":0},{"$f":"IFERROR(VLOOKUP(C16,ELIST!$A$2:$E$300,5,FALSE),0)","v":0}]
["000000001002471731","Gen, Anchor Point","HS_ANCPNT","Anchor Point",{"$f":"IFERROR(VLOOKUP(C17,ELIST!$A$2:$E$300,2,FALSE),0)","v":0},{"$f":"IFERROR(VLOOKUP(C17,ELIST!$A$2:$E$300,5,FALSE),0)","v":0}]
["000000001002471732","Gen, Press Vess Air Rcvr","VP_ARECVR","Press Vess Air Rcvr",{"$f":"IFERROR(VLOOKUP(C18,ELIST!$A$2:$E$300,2,FALSE),0)","v":0},{"$f":"IFERROR(VLOOKUP(C18,ELIST!$A$2:$E$300,5,FALSE),0)","v":0}]
["000000001002471733","Gen, Artwork","AR_ARTWRK","Artwork",{"$f":"IFERROR(VLOOKUP(C19,ELIST!$A$2:$E$300,2,FALSE),0)","v":0},{"$f":"IFERROR(VLOOKUP(C19,ELIST!$A$2:$E$300,5,FALSE),0)","v":0}]
["000000001002471734","Gen, Automatic Doors","BF_ATDOOR","Automatic Doors",{"$f":"IFERROR(VLOOKUP(C20,ELIST!$A$2:$E$300,2,FALSE),0)","v":0},{"$f":"IFERROR(VLOOKUP(C20,ELIST!$A$2:$E$300,5,FALSE),0)","v":0}]
["000000001002471736","Gen, AUX & Tripping Relay","PR_AUXTPR","AUX & Tripping Relay",{"$f":"IFERROR(VLOOKUP(C21,ELIST!$A$2:$E$300,2,FALSE),0)","v":0},{"$f":"IFERROR(VLOOKUP(C21,ELIST!$A$2:$E$300,5,FALSE),0)","v":0}]
["000000001002471737","Gen, Auxilliary Transfrmr","TX_AUXTX","Auxiliary Trf",{"$f":"IFERROR(VLOOKUP(C22,ELIST!$A$2:$E$300,2,FALSE),0)","v":0},{"$f":"IFERROR(VLOOKUP(C22,ELIST!$A$2:$E$300,5,FALSE),0)","v":0}]
["000000001002471738","Gen, Bain Marie","CE_BAINMA","Bain Marie",{"$f":"IFERROR(VLOOKUP(C23,ELIST!$A$2:$E$300,2,FALSE),0)","v":0},{"$f":"IFERROR(VLOOKUP(C23,ELIST!$A$2:$E$300,5,FALSE),0)","v":0}]
["000000001002471739","Gen, Battery","BT_BATT","Battery",{"$f":"IFERROR(VLOOKUP(C24,ELIST!$A$2:$E$300,2,FALSE),0)","v":0},{"$f":"IFERROR(VLOOKUP(C24,ELIST!$A$2:$E$300,5,FALSE),0)","v":0}]
["000000001002471740","Battery Sealed","BT_BATT","Battery",{"$f":"IFERROR(VLOOKUP(C25,ELIST!$A$2:$E$300,2,FALSE),0)","v":0},{"$f":"IFERROR(VLOOKUP(C25,ELIST!$A$2:$E$300,5,FALSE),0)","v":0}]
["000000001002471741","Gen, Battery Charger","BT_BATTCH","Battery Charger",{"$f":"IFERROR(VLOOKUP(C26,ELIST!$A$2:$E$300,2,FALSE),0)","v":0},{"$f":"IFERROR(VLOOKUP(C26,ELIST!$A$2:$E$300,5,FALSE),0)","v":0}]
["000000001002471742","Gen, BBQ","CE_BBQ","BBQ",{"$f":"IFERROR(VLOOKUP(C27,ELIST!$A$2:$E$300,2,FALSE),0)","v":0},{"$f":"IFERROR(VLOOKUP(C27,ELIST!$A$2:$E$300,5,FALSE),0)","v":0}]
["000000001002471743","Gen, Back Flow Prevention","CV_BCKFLW","Back Flow Prevention",{"$f":"IFERROR(VLOOKUP(C28,ELIST!$A$2:$E$300,2,FALSE),0)","v":0},{"$f":"IFERROR(VLOOKUP(C28,ELIST!$A$2:$E$300,5,FALSE),0)","v":0}]
["000000001002471744","Control Building","CV_BLDG","Building",{"$f":"IFERROR(VLOOKUP(C29,ELIST!$A$2:$E$300,2,FALSE),0)","v":0},{"$f":"IFERROR(VLOOKUP(C29,ELIST!$A$2:$E$300,5,FALSE),0)","v":0}]
["000000001002471745","Gen, Building Lighting","CV_BLDGLT","Building Lighting",{"$f":"IFERROR(VLOOKUP(C30,ELIST!$A$2:$E$300,2,FALSE),0)","v":0},{"$f":"IFERROR(VLOOKUP(C30,ELIST!$A$2:$E$300,5,FALSE),0)","v":0}]
["000000001002471746","Gen, Building Roof","CV_BLDGRF","Building Roof",{"$f":"IFERROR(VLOOKUP(C31,ELIST!$A$2:$E$300,2,FALSE),0)","v":0},{"$f":"IFERROR(VLOOKUP(C31,ELIST!$A$2:$E$300,5,FALSE),0)","v":0}]
["000000001002471747","Gen, Bund Wall","CV_BNDWLL","Bund Wall",{"$f":"IFERROR(VLOOKUP(C32,ELIST!$A$2:$E$300,2,FALSE),0)","v":0},{"$f":"IFERROR(VLOOKUP(C32,ELIST!$A$2:$E$300,5,FALSE),0)","v":0}]
["000000001002471748","Gen, Boiling Water Unit","CE_BOILWT","Boiling Water Unit",{"$f":"IFERROR(VLOOKUP(C33,ELIST!$A$2:$E$300,2,FALSE),0)","v":0},{"$f":"IFERROR(VLOOKUP(C33,ELIST!$A$2:$E$300,5,FALSE),0)","v":0}]
["000000001002471749","Gen, Bratt Pan","CE_BRATTP","Bratt Pan",{"$f":"IFERROR(VLOOKUP(C34,ELIST!$A$2:$E$300,2,FALSE),0)","v":0},{"$f":"IFERROR(VLOOKUP(C34,ELIST!$A$2:$E$300,5,FALSE),0)","v":0}]
["000000001002471750","Gen, Crane - Bridge","CN_BRDGCN","Crane - Bridge",{"$f":"IFERROR(VLOOKUP(C35,ELIST!$A$2:$E$300,2,FALSE),0)","v":0},{"$f":"IFERROR(VLOOKUP(C35,ELIST!$A$2:$E$300,5,FALSE),0)","v":0}]
["000000001002471752","Gen, Night Watch Bracket","NW_BRKTNW","Night Watch Bracket",{"$f":"IFERROR(VLOOKUP(C36,ELIST!$A$2:$E$300,2,FALSE),0)","v":0},{"$f":"IFERROR(VLOOKUP(C36,ELIST!$A$2:$E$300,5,FALSE),0)","v":0}]
["000000001002471759","Gen, Trans Busbar","TE_BUSBAR","Trans Busbar",{"$f":"IFERROR(VLOOKUP(C37,ELIST!$A$2:$E$300,2,FALSE),0)","v":0},{"$f":"IFERROR(VLOOKUP(C37,ELIST!$A$2:$E$300,5,FALSE),0)","v":0}]
["000000001002471760","Gen, Busbar Prot Relay","PR_BUSPR","Busbar Prot Relay",{"$f":"IFERROR(VLOOKUP(C38,ELIST!$A$2:$E$300,2,FALSE),0)","v":0},{"$f":"IFERROR(VLOOKUP(C38,ELIST!$A$2:$E$300,5,FALSE),0)","v":0}]
["000000001002471764","Gen, Cage Enclosure","CV_CAGE","Cage Enclosure",{"$f":"IFERROR(VLOOKUP(C39,ELIST!$A$2:$E$300,2,FALSE),0)","v":0},{"$f":"IFERROR(VLOOKUP(C39,ELIST!$A$2:$E$300,5,FALSE),0)","v":0}]
["000000001002471765","Gen, Camera","HW_CAMERA","Camera",{"$f":"IFERROR(VLOOKUP(C40,ELIST!$A$2:$E$300,2,FALSE),0)","v":0},{"$f":"IFERROR(VLOOKUP(C40,ELIST!$A$2:$E$300,5,FALSE),0)","v":0}]
["000000001002471766","Gen, Cap Dischrge Reactor","RE_CAPDIS","Cap Dischrge Reactor",{"$f":"IFERROR(VLOOKUP(C41,ELIST!$A$2:$E$300,2,FALSE),0)","v":0},{"$f":"IFERROR(VLOOKUP(C41,ELIST!$A$2:$E$300,5,FALSE),0)","v":0}]
["000000001002471767","Gen, Cap Switch Reactor","RE_CAPSW","Cap Switch Reactor",{"$f":"IFERROR(VLOOKUP(C42,ELIST!$A$2:$E$300,2,FALSE),0)","v":0},{"$f":"IFERROR(VLOOKUP(C42,ELIST!$A$2:$E$300,5,FALSE),0)","v":0}]
["000000001002471768","Gen, Post Capacitor VT","VT_CAPVT","Post Capacitor VT",{"$f":"IFERROR(VLOOKUP(C43,ELIST!$A$2:$E$300,2,FALSE),0)","v":0},{"$f":"IFERROR(VLOOKUP(C43,ELIST!$A$2:$E$300,5,FALSE),0)","v":0}]
["000000001002471769","Post Capacitor VT Oil Outdoor","VT_CAPVT","Post Capacitor VT",{"$f":"IFERROR(VLOOKUP(C44,ELIST!$A$2:$E$300,2,FALSE),0)","v":0},{"$f":"IFERROR(VLOOKUP(C44,ELIST!$A$2:$E$300,5,FALSE),0)","v":0}]
["000000001002471770","Post Capacitor VT Oil Indoor","VT_CAPVT","Post Capacitor VT",{"$f":"IFERROR(VLOOKUP(C45,ELIST!$A$2:$E$300,2,FALSE),0)","v":0},{"$f":"IFERROR(VLOOKUP(C45,ELIST!$A$2:$E$300,5,FALSE),0)","v":0}]
["000000001002471771","Post Capacitor VT SF6 Outdoor","VT_CAPVT","Post Capacitor VT",{"$f":"IFERROR(VLOOKUP(C46,ELIST!$A$2:$E$300,2,FALSE),0)","v":0},{"$f":"IFERROR(VLOOKUP(C46,ELIST!$A$2:$E$300,5,FALSE),0)","v":0}]
["000000001002471772","Post Capacitor VT SF6 Indoor","VT_CAPVT","Post Capacitor VT",{"$f":"IFERROR(VLOOKUP(C47,ELIST!$A$2:$E$300,2,FALSE),0)","v":0},{"$f":"IFERROR(VLOOKUP(C47,ELIST!$A$2:$E$300,5,FALSE),0)","v":0}]
["000000001002471773","Post Capacitor VT Epoxy Outdoor","VT_CAPVT","Post Capacitor VT",{"$f":"IFERROR(VLOOKUP(C48,ELIST!$A$2:$E$300,2,FALSE),0)","v":0},{"$f":"IFERROR(VLOOKUP(C48,ELIST!$A$2:$E$300,5,FALSE),0)","v":0}]
["000000001002471774","Post Capacitor VT Epoxy Indoor","VT_CAPVT","Post Capacitor VT",{"$f":"IFERROR(VLOOKUP(C49,ELIST!$A$2:$E$300,2,FALSE),0)","v":0},{"$f":"IFERROR(VLOOKUP(C49,ELIST!$A$2:$E$300,5,FALSE),0)","v":0}]
["000000001002471775","Post Capacitor VT GIS Outdoor","VT_CAPVT","Post Capacitor VT",{"$f":"IFERROR(VLOOKUP(C50,ELIST!$A$2:$E$300,2,FALSE),0)","v":0},{"$f":"IFERROR(VLOOKUP(C50,ELIST!$A$2:$E$300,5,FALSE),0)","v":0}]
["000000001002471776","Post Capacitor VT GIS Indoor","VT_CAPVT","Post Capacitor VT",{"$f":"IFERROR(VLOOKUP(C51,ELIST!$A$2:$E$300,2,FALSE),0)","v":0},{"$f":"IFERROR(VLOOKUP(C51,ELIST!$A$2:$E$300,5,FALSE),0)","v":0}]
["000000001002471779","Gen, Metering (CCT) VT","VT_CCTVT","Metering (CCT) VT",{"$f":"IFERROR(VLOOKUP(C52,ELIST!$A$2:$E$300,2,FALSE),0)","v":0},{"$f":"IFERROR(VLOOKUP(C52,ELIST!$A$2:$E$300,5,FALSE),0)","v":0}]
["000000001002471780","Metering (CCT) VT Oil Outdoor","VT_CCTVT","Metering (CCT) VT",{"$f":"IFERROR(VLOOKUP(C53,ELIST!$A$2:$E$300,2,FALSE),0)","v":0},{"$f":"IFERROR(VLOOKUP(C53,ELIST!$A$2:$E$300,5,FALSE),0)","v":0}]
["000000001002471781","Metering (CCT) VT Oil Indoor","VT_CCTVT","Metering (CCT) VT",{"$f":"IFERROR(VLOOKUP(C54,ELIST!$A$2:$E$300,2,FALSE),0)","v":0},{"$f":"IFERROR(VLOOKUP(C54,ELIST!$A$2:$E$300,5,FALSE),0)","v":0}]
["000000001002471782","Metering (CCT) VT SF6 Outdoor","VT_CCTVT","Metering (CCT) VT",{"$f":"IFERROR(VLOOKUP(C55,ELIST!$A$2:$E$300,2,FALSE),0)","v":0},{"$f":"IFERROR(VLOOKUP(C55,ELIST!$A$2:$E$300,5,FALSE),0)","v":0}]
["000000001002471783","Metering (CCT) VT SF6 Indoor","VT_CCTVT","Metering (CCT) VT",{"$f":"IFERROR(VLOOKUP(C56,ELIST!$A$2:$E$300,2,FALSE),0)","v":0},{"$f":"IFERROR(VLOOKUP(C56,ELIST!$A$2:$E$300,5,FALSE),0)","v":0}]
["000000001002471784","Metering (CCT) VT Epoxy Outdoor","VT_CCTVT","Metering (CCT) VT",{"$f":"IFERROR(VLOOKUP(C57,ELIST!$A$2:$E$300,2,FALSE),0)","v":0},{"$f":"IFERROR(VLOOKUP(C57,ELIST!$A$2:$E$300,5,FALSE),0)","v":0}]
["000000001002471785","Metering (CCT) VT Epoxy Indoor","VT_CCTVT","Metering (CCT) VT",{"$f":"IFERROR(VLOOKUP(C58,ELIST!$A$2:$E$300,2,FALSE),0)","v":0},{"$f":"IFERROR(VLOOKUP(C58,ELIST!$A$2:$E$300,5,FALSE),0)","v":0}]
["000000001002471786","Metering (CCT) VT GIS Outdoor","VT_CCTVT","Metering (CCT) VT",{"$f":"IFERROR(VLOOKUP(C59,ELIST!$A$2:$E$300,2,FALSE),0)","v":0},{"$f":"IFERROR(VLOOKUP(C59,ELIST!$A$2:$E$300,5,FALSE),0)","v":0}]
["000000001002471787","Metering (CCT) VT GIS Indoor","VT_CCTVT","Metering (CCT) VT",{"$f":"IFERROR(VLOOKUP(C60,ELIST!$A$2:$E$300,2,FALSE),0)","v":0},{"$f":"IFERROR(VLOOKUP(C60,ELIST!$A$2:$E$300,5,FALSE),0)","v":0}]
["000000001002471788","Gen, Changeover Switch","TE_CHGOSW","Changeover Switch",{"$f":"IFERROR(VLOOKUP(C61,ELIST!$A$2:$E$300,2,FALSE),0)","v":0},{"$f":"IFERROR(VLOOKUP(C61,ELIST!$A$2:$E$300,5,FALSE),0)","v":0}]
["000000001002471789","Gen, HVAC Chiller","HC_CHILLR","HVAC Chiller",{"$f":"IFERROR(VLOOKUP(C62,ELIST!$A$2:$E$300,2,FALSE),0)","v":0},{"$f":"IFERROR(VLOOKUP(C62,ELIST!$A$2:$E$300,5,FALSE),0)","v":0}]
["000000001002471790","Gen, Chain Wire Enclosure","CV_CHNFNC","Chain Wire Enclosure",{"$f":"IFERROR(VLOOKUP(C63,ELIST!$A$2:$E$300,2,FALSE),0)","v":0},{"$f":"IFERROR(VLOOKUP(C63,ELIST!$A$2:$E$300,5,FALSE),0)","v":0}]
["000000001002471791","Gen, Safe Clearance Fence","CV_CLRFNC","Safe Clearance Fence",{"$f":"IFERROR(VLOOKUP(C64,ELIST!$A$2:$E$300,2,FALSE),0)","v":0},{"$f":"IFERROR(VLOOKUP(C64,ELIST!$A$2:$E$300,5,FALSE),0)","v":0}]
["000000001002471792","Gen, HVAC Cooling Tower","HC_CLTOWR","HVAC Cooling Tower",{"$f":"IFERROR(VLOOKUP(C65,ELIST!$A$2:$E$300,2,FALSE),0)","v":0},{"$f":"IFERROR(VLOOKUP(C65,ELIST!$A$2:$E$300,5,FALSE),0)","v":0}]
["000000001002471793","Gen, COMMS Battery","BT_CMBATT","COMMS Battery",{"$f":"IFERROR(VLOOKUP(C66,ELIST!$A$2:$E$300,2,FALSE),0)","v":0},{"$f":"IFERROR(VLOOKUP(C66,ELIST!$A$2:$E$300,5,FALSE),0)","v":0}]
["000000001002471799","Gen, Cap Contactor","TE_CNTCAP","Cap Contactor",{"$f":"IFERROR(VLOOKUP(C67,ELIST!$A$2:$E$300,2,FALSE),0)","v":0},{"$f":"IFERROR(VLOOKUP(C67,ELIST!$A$2:$E$300,5,FALSE),0)","v":0}]
["000000001002471800","Gen, Contactor","AF_CNTCTR","Contactor",{"$f":"IFERROR(VLOOKUP(C68,ELIST!$A$2:$E$300,2,FALSE),0)","v":0},{"$f":"IFERROR(VLOOKUP(C68,ELIST!$A$2:$E$300,5,FALSE),0)","v":0}]
["000000001002471801","Gen, Air Compressor","VP_COMPRS","Air Compressor",{"$f":"IFERROR(VLOOKUP(C69,ELIST!$A$2:$E$300,2,FALSE),0)","v":0},{"$f":"IFERROR(VLOOKUP(C69,ELIST!$A$2:$E$300,5,FALSE),0)","v":0}]
["000000001002471803","Gen, Coupling Cell Cap","AF_CPLCAP","Coupling Cell Cap",{"$f":"IFERROR(VLOOKUP(C70,ELIST!$A$2:$E$300,2,FALSE),0)","v":0},{"$f":"IFERROR(VLOOKUP(C70,ELIST!$A$2:$E$300,5,FALSE),0)","v":0}]
["000000001002471804","Gen, Coupling Cell Coils","AF_CPLCL","Coupling Cell Coils",{"$f":"IFERROR(VLOOKUP(C71,ELIST!$A$2:$E$300,2,FALSE),0)","v":0},{"$f":"IFERROR(VLOOKUP(C71,ELIST!$A$2:$E$300,5,FALSE),0)","v":0}]
["000000001002471805","Gen, Car","FL_CR","Car",{"$f":"IFERROR(VLOOKUP(C72,ELIST!$A$2:$E$300,2,FALSE),0)","v":0},{"$f":"IFERROR(VLOOKUP(C72,ELIST!$A$2:$E$300,5,FALSE),0)","v":0}]
["000000001002471806","Gen, HVAC cmptr rm Air Cn","HC_CRAC","HVAC Cmptr Rm AirCon",{"$f":"IFERROR(VLOOKUP(C73,ELIST!$A$2:$E$300,2,FALSE),0)","v":0},{"$f":"IFERROR(VLOOKUP(C73,ELIST!$A$2:$E$300,5,FALSE),0)","v":0}]
["000000001002471807","Gen, Core Balance CT","CT_CRBLCT","Core Balance CT",{"$f":"IFERROR(VLOOKUP(C74,ELIST!$A$2:$E$300,2,FALSE),0)","v":0},{"$f":"IFERROR(VLOOKUP(C74,ELIST!$A$2:$E$300,5,FALSE),0)","v":0}]
["000000001002471808","Core Balance CT Split Core","CT_CRBLCT","Core Balance CT",{"$f":"IFERROR(VLOOKUP(C75,ELIST!$A$2:$E$300,2,FALSE),0)","v":0},{"$f":"IFERROR(VLOOKUP(C75,ELIST!$A$2:$E$300,5,FALSE),0)","v":0}]
["000000001002471809","Gen, Coolroom Freezer","CE_CRFRZR","Coolroom Freezer",{"$f":"IFERROR(VLOOKUP(C76,ELIST!$A$2:$E$300,2,FALSE),0)","v":0},{"$f":"IFERROR(VLOOKUP(C76,ELIST!$A$2:$E$300,5,FALSE),0)","v":0}]
["000000001002471810","Gen, Coolroom Refridgertr","CE_CRREFD","Coolroom Refridgertr",{"$f":"IFERROR(VLOOKUP(C77,ELIST!$A$2:$E$300,2,FALSE),0)","v":0},{"$f":"IFERROR(VLOOKUP(C77,ELIST!$A$2:$E$300,5,FALSE),0)","v":0}]
["000000001002471824","Gen, First Aid Defibrlltr","FA_DEFIB","First Aid Defibrlltr",{"$f":"IFERROR(VLOOKUP(C78,ELIST!$A$2:$E$300,2,FALSE),0)","v":0},{"$f":"IFERROR(VLOOKUP(C78,ELIST!$A$2:$E$300,5,FALSE),0)","v":0}]
["000000001002471825","Gen, Deluge Shower","CV_DELUGE","Deluge Shower",{"$f":"IFERROR(VLOOKUP(C79,ELIST!$A$2:$E$300,2,FALSE),0)","v":0},{"$f":"IFERROR(VLOOKUP(C79,ELIST!$A$2:$E$300,5,FALSE),0)","v":0}]
["000000001002471826","Gen, PC Desktop","HW_DESKTP","PC Desktop",{"$f":"IFERROR(VLOOKUP(C80,ELIST!$A$2:$E$300,2,FALSE),0)","v":0},{"$f":"IFERROR(VLOOKUP(C80,ELIST!$A$2:$E$300,5,FALSE),0)","v":0}]
["000000001002471827","Gen, Deep Fryer","CE_DFRYER","Deep Fryer",{"$f":"IFERROR(VLOOKUP(C81,ELIST!$A$2:$E$300,2,FALSE),0)","v":0},{"$f":"IFERROR(VLOOKUP(C81,ELIST!$A$2:$E$300,5,FALSE),0)","v":0}]
["000000001002471828","Gen, Trans Disconnector","TE_DISC","Trans Disconnector",{"$f":"IFERROR(VLOOKUP(C82,ELIST!$A$2:$E$300,2,FALSE),0)","v":0},{"$f":"IFERROR(VLOOKUP(C82,ELIST!$A$2:$E$300,5,FALSE),0)","v":0}]
["000000001002471829","Gen, Distance Prot Relay","PR_DISTPR","Distance Prot Relay",{"$f":"IFERROR(VLOOKUP(C83,ELIST!$A$2:$E$300,2,FALSE),0)","v":0},{"$f":"IFERROR(VLOOKUP(C83,ELIST!$A$2:$E$300,5,FALSE),0)","v":0}]
["000000001002471839","Gen, Door - Sliding","CV_DRSLD","Door - Sliding",{"$f":"IFERROR(VLOOKUP(C84,ELIST!$A$2:$E$300,2,FALSE),0)","v":0},{"$f":"IFERROR(VLOOKUP(C84,ELIST!$A$2:$E$300,5,FALSE),0)","v":0}]
["000000001002471841","Gen, Driveway","CV_DRVWY","Driveway",{"$f":"IFERROR(VLOOKUP(C85,ELIST!$A$2:$E$300,2,FALSE),0)","v":0},{"$f":"IFERROR(VLOOKUP(C85,ELIST!$A$2:$E$300,5,FALSE),0)","v":0}]
["000000001002471842","Gen, Dishwasher","CE_DSHWSR","Dishwasher",{"$f":"IFERROR(VLOOKUP(C86,ELIST!$A$2:$E$300,2,FALSE),0)","v":0},{"$f":"IFERROR(VLOOKUP(C86,ELIST!$A$2:$E$300,5,FALSE),0)","v":0}]
["000000001002471843","Gen, DSUB Radio","CM_DSRAD","DSUB Radio",{"$f":"IFERROR(VLOOKUP(C87,ELIST!$A$2:$E$300,2,FALSE),0)","v":0},{"$f":"IFERROR(VLOOKUP(C87,ELIST!$A$2:$E$300,5,FALSE),0)","v":0}]
["000000001002471844","Gen, Docking Station","HW_DSTATN","Docking Station",{"$f":"IFERROR(VLOOKUP(C88,ELIST!$A$2:$E$300,2,FALSE),0)","v":0},{"$f":"IFERROR(VLOOKUP(C88,ELIST!$A$2:$E$300,5,FALSE),0)","v":0}]
["000000001002471845","Gen, Vacuum Circuit Breaker","CB_DTKCB","Dead Tank CB",{"$f":"IFERROR(VLOOKUP(C89,ELIST!$A$2:$E$300,2,FALSE),0)","v":0},{"$f":"IFERROR(VLOOKUP(C89,ELIST!$A$2:$E$300,5,FALSE),0)","v":0}]
["000000001002471846","Fault Throwing Switch","CB_DTKCB","Dead Tank CB",{"$f":"IFERROR(VLOOKUP(C90,ELIST!$A$2:$E$300,2,FALSE),0)","v":0},{"$f":"IFERROR(VLOOKUP(C90,ELIST!$A$2:$E$300,5,FALSE),0)","v":0}]
["000000001002471847","Gen, SF6 Circuit Breaker","CB_DTKCB","Dead Tank CB",{"$f":"IFERROR(VLOOKUP(C91,ELIST!$A$2:$E$300,2,FALSE),0)","v":0},{"$f":"IFERROR(VLOOKUP(C91,ELIST!$A$2:$E$300,5,FALSE),0)","v":0}]
["000000001002471848","Vacuum Circuit Breaker","CB_DTKCB","Dead Tank CB",{"$f":"IFERROR(VLOOKUP(C92,ELIST!$A$2:$E$300,2,FALSE),0)","v":0},{"$f":"IFERROR(VLOOKUP(C92,ELIST!$A$2:$E$300,5,FALSE),0)","v":0}]
["000000001002471849","Gen, Bulk Oil CB","CB_DTKCB","Dead Tank CB",{"$f":"IFERROR(VLOOKUP(C93,ELIST!$A$2:$E$300,2,FALSE),0)","v":0},{"$f":"IFERROR(VLOOKUP(C93,ELIST!$A$2:$E$300,5,FALSE),0)","v":0}]
["000000001002471850","Gen, Small Oil CB","CB_DTKCB","Dead Tank CB",{"$f":"IFERROR(VLOOKUP(C94,ELIST!$A$2:$E$300,2,FALSE),0)","v":0},{"$f":"IFERROR(VLOOKUP(C94,ELIST!$A$2:$E$300,5,FALSE),0)","v":0}]
["000000001002471851","Gen, Tool Electrc Powered","TO_ELEC","Tool Electrc Powered",{"$f":"IFERROR(VLOOKUP(C95,ELIST!$A$2:$E$300,2,FALSE),0)","v":0},{"$f":"IFERROR(VLOOKUP(C95,ELIST!$A$2:$E$300,5,FALSE),0)","v":0}]
["000000001002471853","Gen, Epoxy CT","CT_EPXYCT","Epoxy CT",{"$f":"IFERROR(VLOOKUP(C96,ELIST!$A$2:$E$300,2,FALSE),0)","v":0},{"$f":"IFERROR(VLOOKUP(C96,ELIST!$A$2:$E$300,5,FALSE),0)","v":0}]
["000000001002471854","Gen, Portable Earth","ER_ERPORT","Portable Earth",{"$f":"IFERROR(VLOOKUP(C97,ELIST!$A$2:$E$300,2,FALSE),0)","v":0},{"$f":"IFERROR(VLOOKUP(C97,ELIST!$A$2:$E$300,5,FALSE),0)","v":0}]
["000000001002471855","Gen, Earth Switch - Dist","DG_ERSWD","Dist Earth Switch",{"$f":"IFERROR(VLOOKUP(C98,ELIST!$A$2:$E$300,2,FALSE),0)","v":0},{"$f":"IFERROR(VLOOKUP(C98,ELIST!$A$2:$E$300,5,FALSE),0)","v":0}]
["000000001002471856","Gen, Trans Earth Switch","TE_ERSWT","Trans Earth Switch",{"$f":"IFERROR(VLOOKUP(C99,ELIST!$A$2:$E$300,2,FALSE),0)","v":0},{"$f":"IFERROR(VLOOKUP(C99,ELIST!$A$2:$E$300,5,FALSE),0)","v":0}]
["000000001002471857","Trans Earth Switch Indoor Motorised","TE_ERSWT","Trans Earth Switch",{"$f":"IFERROR(VLOOKUP(C100,ELIST!$A$2:$E$300,2,FALSE),0)","v":0},{"$f":"IFERROR(VLOOKUP(C100,ELIST!$A$2:$E$300,5,FALSE),0)","v":0}]
["000000001002471858","Trans Earth Switch Indoor","TE_ERSWT","Trans Earth Switch",{"$f":"IFERROR(VLOOKUP(C101,ELIST!$A$2:$E$300,2,FALSE),0)","v":0},{"$f":"IFERROR(VLOOKUP(C101,ELIST!$A$2:$E$300,5,FALSE),0)","v":0}]
["000000001002471859","Trans Earth Switch Outdoor","TE_ERSWT","Trans Earth Switch",{"$f":"IFERROR(VLOOKUP(C102,ELIST!$A$2:$E$300,2,FALSE),0)","v":0},{"$f":"IFERROR(VLOOKUP(C102,ELIST!$A$2:$E$300,5,FALSE),0)","v":0}]
["000000001002471860","Gen, Earthing Transformer","TX_ERTHTX","Earthing Transformer",{"$f":"IFERROR(VLOOKUP(C103,ELIST!$A$2:$E$300,2,FALSE),0)","v":0},{"$f":"IFERROR(VLOOKUP(C103,ELIST!$A$2:$E$300,5,FALSE),0)","v":0}]
["000000001002471862","Gen, Elevated Work Platform","FL_EWP","ElevatedWork Platfom",{"$f":"IFERROR(VLOOKUP(C104,ELIST!$A$2:$E$300,2,FALSE),0)","v":0},{"$f":"IFERROR(VLOOKUP(C104,ELIST!$A$2:$E$300,5,FALSE),0)","v":0}]
["000000001002471863","EWP Fitter","FL_EWP","ElevatedWork Platfom",{"$f":"IFERROR(VLOOKUP(C105,ELIST!$A$2:$E$300,2,FALSE),0)","v":0},{"$f":"IFERROR(VLOOKUP(C105,ELIST!$A$2:$E$300,5,FALSE),0)","v":0}]
["000000001002471864","EWP General Purpose","FL_EWP","ElevatedWork Platfom",{"$f":"IFERROR(VLOOKUP(C106,ELIST!$A$2:$E$300,2,FALSE),0)","v":0},{"$f":"IFERROR(VLOOKUP(C106,ELIST!$A$2:$E$300,5,FALSE),0)","v":0}]
["000000001002471865","EWP Live Line Distrb","FL_EWP","ElevatedWork Platfom",{"$f":"IFERROR(VLOOKUP(C107,ELIST!$A$2:$E$300,2,FALSE),0)","v":0},{"$f":"IFERROR(VLOOKUP(C107,ELIST!$A$2:$E$300,5,FALSE),0)","v":0}]
["000000001002471866","EWP Live Line Trans","FL_EWP","ElevatedWork Platfom",{"$f":"IFERROR(VLOOKUP(C108,ELIST!$A$2:$E$300,2,FALSE),0)","v":0},{"$f":"IFERROR(VLOOKUP(C108,ELIST!$A$2:$E$300,5,FALSE),0)","v":0}]
["000000001002471867","EWP Service Line","FL_EWP","ElevatedWork Platfom",{"$f":"IFERROR(VLOOKUP(C109,ELIST!$A$2:$E$300,2,FALSE),0)","v":0},{"$f":"IFERROR(VLOOKUP(C109,ELIST!$A$2:$E$300,5,FALSE),0)","v":0}]
["000000001002471868","EWP Street Light","FL_EWP","ElevatedWork Platfom",{"$f":"IFERROR(VLOOKUP(C110,ELIST!$A$2:$E$300,2,FALSE),0)","v":0},{"$f":"IFERROR(VLOOKUP(C110,ELIST!$A$2:$E$300,5,FALSE),0)","v":0}]
["000000001002471869","EWP Vegetation","FL_EWP","ElevatedWork Platfom",{"$f":"IFERROR(VLOOKUP(C111,ELIST!$A$2:$E$300,2,FALSE),0)","v":0},{"$f":"IFERROR(VLOOKUP(C111,ELIST!$A$2:$E$300,5,FALSE),0)","v":0}]
["000000001002471870","Gen, HVAC Exhaust Fan","HC_EXHFAN","HVAC Exhaust Fan",{"$f":"IFERROR(VLOOKUP(C112,ELIST!$A$2:$E$300,2,FALSE),0)","v":0},{"$f":"IFERROR(VLOOKUP(C112,ELIST!$A$2:$E$300,5,FALSE),0)","v":0}]
["000000001002471871","Gen, Eye Wash Station","CV_EYEWSH","Eye Wash Station",{"$f":"IFERROR(VLOOKUP(C113,ELIST!$A$2:$E$300,2,FALSE),0)","v":0},{"$f":"IFERROR(VLOOKUP(C113,ELIST!$A$2:$E$300,5,FALSE),0)","v":0}]
["000000001002471872","Gen, Fall Arrestor","HS_FALART","Fall Arrestor",{"$f":"IFERROR(VLOOKUP(C114,ELIST!$A$2:$E$300,2,FALSE),0)","v":0},{"$f":"IFERROR(VLOOKUP(C114,ELIST!$A$2:$E$300,5,FALSE),0)","v":0}]
["000000001002471873","Gen, Fire Alarm Detector","FE_FALRMD","Fire Alarm Detector",{"$f":"IFERROR(VLOOKUP(C115,ELIST!$A$2:$E$300,2,FALSE),0)","v":0},{"$f":"IFERROR(VLOOKUP(C115,ELIST!$A$2:$E$300,5,FALSE),0)","v":0}]
["000000001002471874","Gen, Fire Alarm Panel","FE_FALRMP","Fire Alarm Panel",{"$f":"IFERROR(VLOOKUP(C116,ELIST!$A$2:$E$300,2,FALSE),0)","v":0},{"$f":"IFERROR(VLOOKUP(C116,ELIST!$A$2:$E$300,5,FALSE),0)","v":0}]
["000000001002471875","Gen, Fax Machine","HW_FAX","Fax Machine",{"$f":"IFERROR(VLOOKUP(C117,ELIST!$A$2:$E$300,2,FALSE),0)","v":0},{"$f":"IFERROR(VLOOKUP(C117,ELIST!$A$2:$E$300,5,FALSE),0)","v":0}]
["000000001002471877","Gen, Fire Blankets - Gel","FE_FBLGEL","Fire Blankets - Gel",{"$f":"IFERROR(VLOOKUP(C118,ELIST!$A$2:$E$300,2,FALSE),0)","v":0},{"$f":"IFERROR(VLOOKUP(C118,ELIST!$A$2:$E$300,5,FALSE),0)","v":0}]
["000000001002471878","Gen, HVAC Fan Coil Unit","HC_FCU","HVAC Fan Coil Unit",{"$f":"IFERROR(VLOOKUP(C119,ELIST!$A$2:$E$300,2,FALSE),0)","v":0},{"$f":"IFERROR(VLOOKUP(C119,ELIST!$A$2:$E$300,5,FALSE),0)","v":0}]
["000000001002471879","Gen, Feeder Diff Relay","PR_FDDFPR","Feeder Diff Relay",{"$f":"IFERROR(VLOOKUP(C120,ELIST!$A$2:$E$300,2,FALSE),0)","v":0},{"$f":"IFERROR(VLOOKUP(C120,ELIST!$A$2:$E$300,5,FALSE),0)","v":0}]
["000000001002471880","Gen, Fire Damper HVAC","FE_FDHVAC","Fire Damper HVAC",{"$f":"IFERROR(VLOOKUP(C121,ELIST!$A$2:$E$300,2,FALSE),0)","v":0},{"$f":"IFERROR(VLOOKUP(C121,ELIST!$A$2:$E$300,5,FALSE),0)","v":0}]
["000000001002471881","Gen, Fire Door - Sliding","FE_FDRSLD","Fire Door - Sliding",{"$f":"IFERROR(VLOOKUP(C122,ELIST!$A$2:$E$300,2,FALSE),0)","v":0},{"$f":"IFERROR(VLOOKUP(C122,ELIST!$A$2:$E$300,5,FALSE),0)","v":0}]
["000000001002471882","Gen, Fire Door - Standard","FE_FDRSTD","Fire Door - Standard",{"$f":"IFERROR(VLOOKUP(C123,ELIST!$A$2:$E$300,2,FALSE),0)","v":0},{"$f":"IFERROR(VLOOKUP(C123,ELIST!$A$2:$E$300,5,FALSE),0)","v":0}]
["000000001002471883","Fire Rated Door","FE_FDRSTD","Fire Door - Standard",{"$f":"IFERROR(VLOOKUP(C124,ELIST!$A$2:$E$300,2,FALSE),0)","v":0},{"$f":"IFERROR(VLOOKUP(C124,ELIST!$A$2:$E$300,5,FALSE),0)","v":0}]
["000000001002471886","Gen, Fire Indicator Panel","FE_FIP","Fire Indicator Panel",{"$f":"IFERROR(VLOOKUP(C125,ELIST!$A$2:$E$300,2,FALSE),0)","v":0},{"$f":"IFERROR(VLOOKUP(C125,ELIST!$A$2:$E$300,5,FALSE),0)","v":0}]
["000000001002471887","Gen, Fire Wall","CV_FIRWLL","Fire Wall",{"$f":"IFERROR(VLOOKUP(C126,ELIST!$A$2:$E$300,2,FALSE),0)","v":0},{"$f":"IFERROR(VLOOKUP(C126,ELIST!$A$2:$E$300,5,FALSE),0)","v":0}]
["000000001002471888","Gen, Fire Pump Set","FE_FPUMP","Fire Pump Set",{"$f":"IFERROR(VLOOKUP(C127,ELIST!$A$2:$E$300,2,FALSE),0)","v":0},{"$f":"IFERROR(VLOOKUP(C127,ELIST!$A$2:$E$300,5,FALSE),0)","v":0}]
["000000001002471889","Gen, Fire Shutters/Vent","FE_FSHVNT","Fire Shutters/Vent",{"$f":"IFERROR(VLOOKUP(C128,ELIST!$A$2:$E$300,2,FALSE),0)","v":0},{"$f":"IFERROR(VLOOKUP(C128,ELIST!$A$2:$E$300,5,FALSE),0)","v":0}]
["000000001002471891","Gen, Fire Storage Tank","FE_FSTTNK","Fire Storage Tank",{"$f":"IFERROR(VLOOKUP(C129,ELIST!$A$2:$E$300,2,FALSE),0)","v":0},{"$f":"IFERROR(VLOOKUP(C129,ELIST!$A$2:$E$300,5,FALSE),0)","v":0}]
["000000001002471892","Gen, HVAC fume Cupboard","HC_FUMECP","HVAC fume Cupboard",{"$f":"IFERROR(VLOOKUP(C130,ELIST!$A$2:$E$300,2,FALSE),0)","v":0},{"$f":"IFERROR(VLOOKUP(C130,ELIST!$A$2:$E$300,5,FALSE),0)","v":0}]
["000000001002471894","Gen, Gas Bottle","CH_GASBOT","Gas Bottle",{"$f":"IFERROR(VLOOKUP(C131,ELIST!$A$2:$E$300,2,FALSE),0)","v":0},{"$f":"IFERROR(VLOOKUP(C131,ELIST!$A$2:$E$300,5,FALSE),0)","v":0}]
["000000001002471895","Gen, Gas Suppression Sys","FE_GASSSY","Gas Suppression Sys",{"$f":"IFERROR(VLOOKUP(C132,ELIST!$A$2:$E$300,2,FALSE),0)","v":0},{"$f":"IFERROR(VLOOKUP(C132,ELIST!$A$2:$E$300,5,FALSE),0)","v":0}]
["000000001002471897","Gen, Generator","GN_GENATR","Generator",{"$f":"IFERROR(VLOOKUP(C133,ELIST!$A$2:$E$300,2,FALSE),0)","v":0},{"$f":"IFERROR(VLOOKUP(C133,ELIST!$A$2:$E$300,5,FALSE),0)","v":0}]
["000000001002471899","Gen, Generator Facility","GN_GENRTR","Generator Facility",{"$f":"IFERROR(VLOOKUP(C134,ELIST!$A$2:$E$300,2,FALSE),0)","v":0},{"$f":"IFERROR(VLOOKUP(C134,ELIST!$A$2:$E$300,5,FALSE),0)","v":0}]
["000000001002471900","Gen, Crane - Gantry","CN_GNTYCN","Crane - Gantry",{"$f":"IFERROR(VLOOKUP(C135,ELIST!$A$2:$E$300,2,FALSE),0)","v":0},{"$f":"IFERROR(VLOOKUP(C135,ELIST!$A$2:$E$300,5,FALSE),0)","v":0}]
["000000001002471901","Gen, Grill","CE_GRILL","Grill",{"$f":"IFERROR(VLOOKUP(C136,ELIST!$A$2:$E$300,2,FALSE),0)","v":0},{"$f":"IFERROR(VLOOKUP(C136,ELIST!$A$2:$E$300,5,FALSE),0)","v":0}]
["000000001002471902","Gen, Hand Tools","TO_HAND","Hand Tools",{"$f":"IFERROR(VLOOKUP(C137,ELIST!$A$2:$E$300,2,FALSE),0)","v":0},{"$f":"IFERROR(VLOOKUP(C137,ELIST!$A$2:$E$300,5,FALSE),0)","v":0}]
["000000001002471903","Gen, Harness and Lanyard","HS_HARNES","Harness and Lanyard",{"$f":"IFERROR(VLOOKUP(C138,ELIST!$A$2:$E$300,2,FALSE),0)","v":0},{"$f":"IFERROR(VLOOKUP(C138,ELIST!$A$2:$E$300,5,FALSE),0)","v":0}]
["000000001002471904","Gen, Helicopter Helmet","SF_HELMET","Helicopter Helmet",{"$f":"IFERROR(VLOOKUP(C139,ELIST!$A$2:$E$300,2,FALSE),0)","v":0},{"$f":"IFERROR(VLOOKUP(C139,ELIST!$A$2:$E$300,5,FALSE),0)","v":0}]
["000000001002471905","Gen, Hose Reel","FE_HOSERL","Hose Reel",{"$f":"IFERROR(VLOOKUP(C140,ELIST!$A$2:$E$300,2,FALSE),0)","v":0},{"$f":"IFERROR(VLOOKUP(C140,ELIST!$A$2:$E$300,5,FALSE),0)","v":0}]
["000000001002471906","Gen, Hotwater system","HC_HOTWTR","Hotwater system",{"$f":"IFERROR(VLOOKUP(C141,ELIST!$A$2:$E$300,2,FALSE),0)","v":0},{"$f":"IFERROR(VLOOKUP(C141,ELIST!$A$2:$E$300,5,FALSE),0)","v":0}]
["000000001002471915","Gen, Tool Hydraulic Powrd","TO_HYDRLC","Tool Hydraulic Powrd",{"$f":"IFERROR(VLOOKUP(C142,ELIST!$A$2:$E$300,2,FALSE),0)","v":0},{"$f":"IFERROR(VLOOKUP(C142,ELIST!$A$2:$E$300,5,FALSE),0)","v":0}]
["000000001002471916","Gen, Fire Hydrant","FE_HYDRNT","Fire Hydrant",{"$f":"IFERROR(VLOOKUP(C143,ELIST!$A$2:$E$300,2,FALSE),0)","v":0},{"$f":"IFERROR(VLOOKUP(C143,ELIST!$A$2:$E$300,5,FALSE),0)","v":0}]
["000000001002471917","Gen, Hydraulic Accumulatr","VP_HYRACC","Hydraulic Accumulatr",{"$f":"IFERROR(VLOOKUP(C144,ELIST!$A$2:$E$300,2,FALSE),0)","v":0},{"$f":"IFERROR(VLOOKUP(C144,ELIST!$A$2:$E$300,5,FALSE),0)","v":0}]
["000000001002471918","Gen, Ice Machine","CE_ICEMCH","Ice Machine",{"$f":"IFERROR(VLOOKUP(C145,ELIST!$A$2:$E$300,2,FALSE),0)","v":0},{"$f":"IFERROR(VLOOKUP(C145,ELIST!$A$2:$E$300,5,FALSE),0)","v":0}]
["000000001002471919","Gen, Indoor Capacitor","CU_INCAP","Indoor Capacitor",{"$f":"IFERROR(VLOOKUP(C146,ELIST!$A$2:$E$300,2,FALSE),0)","v":0},{"$f":"IFERROR(VLOOKUP(C146,ELIST!$A$2:$E$300,5,FALSE),0)","v":0}]
["000000001002471920","Outdoor Capacitor","CU_INCAP","Indoor Capacitor",{"$f":"IFERROR(VLOOKUP(C147,ELIST!$A$2:$E$300,2,FALSE),0)","v":0},{"$f":"IFERROR(VLOOKUP(C147,ELIST!$A$2:$E$300,5,FALSE),0)","v":0}]
["000000001002471921","Outdoor Enclosed Cap 11kV ABB","CU_INCAP","Indoor Capacitor",{"$f":"IFERROR(VLOOKUP(C148,ELIST!$A$2:$E$300,2,FALSE),0)","v":0},{"$f":"IFERROR(VLOOKUP(C148,ELIST!$A$2:$E$300,5,FALSE),0)","v":0}]
["000000001002471922","Outdoor Enclosed Cap 11kV Other","CU_INCAP","Indoor Capacitor",{"$f":"IFERROR(VLOOKUP(C149,ELIST!$A$2:$E$300,2,FALSE),0)","v":0},{"$f":"IFERROR(VLOOKUP(C149,ELIST!$A$2:$E$300,5,FALSE),0)","v":0}]
["000000001002471923","Outdoor Enclosed Cap 22kV","CU_INCAP","Indoor Capacitor",{"$f":"IFERROR(VLOOKUP(C150,ELIST!$A$2:$E$300,2,FALSE),0)","v":0},{"$f":"IFERROR(VLOOKUP(C150,ELIST!$A$2:$E$300,5,FALSE),0)","v":0}]
["000000001002471924","Outdoor Enclosed Cap 33kV","CU_INCAP","Indoor Capacitor",{"$f":"IFERROR(VLOOKUP(C151,ELIST!$A$2:$E$300,2,FALSE),0)","v":0},{"$f":"IFERROR(VLOOKUP(C151,ELIST!$A$2:$E$300,5,FALSE),0)","v":0}]
["000000001002471925","Outdoor Enclosed Cap 66kV","CU_INCAP","Indoor Capacitor",{"$f":"IFERROR(VLOOKUP(C152,ELIST!$A$2:$E$300,2,FALSE),0)","v":0},{"$f":"IFERROR(VLOOKUP(C152,ELIST!$A$2:$E$300,5,FALSE),0)","v":0}]
["000000001002471926","Outdoor Enclosed Cap 132kV","CU_INCAP","Indoor Capacitor",{"$f":"IFERROR(VLOOKUP(C153,ELIST!$A$2:$E$300,2,FALSE),0)","v":0},{"$f":"IFERROR(VLOOKUP(C153,ELIST!$A$2:$E$300,5,FALSE),0)","v":0}]
["000000001002471927","Gen, Instrument","IN_INSTMT","Instrument",{"$f":"IFERROR(VLOOKUP(C154,ELIST!$A$2:$E$300,2,FALSE),0)","v":0},{"$f":"IFERROR(VLOOKUP(C154,ELIST!$A$2:$E$300,5,FALSE),0)","v":0}]
["000000001002471928","Gen, Integrated CB","CB_INTCB","Integrated CB",{"$f":"IFERROR(VLOOKUP(C155,ELIST!$A$2:$E$300,2,FALSE),0)","v":0},{"$f":"IFERROR(VLOOKUP(C155,ELIST!$A$2:$E$300,5,FALSE),0)","v":0}]
["000000001002471929","Integrated CB Bulk Oil","CB_INTCB","Integrated CB",{"$f":"IFERROR(VLOOKUP(C156,ELIST!$A$2:$E$300,2,FALSE),0)","v":0},{"$f":"IFERROR(VLOOKUP(C156,ELIST!$A$2:$E$300,5,FALSE),0)","v":0}]
["000000001002471930","Integrated CB Small Oil","CB_INTCB","Integrated CB",{"$f":"IFERROR(VLOOKUP(C157,ELIST!$A$2:$E$300,2,FALSE),0)","v":0},{"$f":"IFERROR(VLOOKUP(C157,ELIST!$A$2:$E$300,5,FALSE),0)","v":0}]
["000000001002471931","Gen, Integrated VT","VT_INTVT","Integrated VT",{"$f":"IFERROR(VLOOKUP(C158,ELIST!$A$2:$E$300,2,FALSE),0)","v":0},{"$f":"IFERROR(VLOOKUP(C158,ELIST!$A$2:$E$300,5,FALSE),0)","v":0}]
["000000001002471932","Integrated VT Oil Outdoor","VT_INTVT","Integrated VT",{"$f":"IFERROR(VLOOKUP(C159,ELIST!$A$2:$E$300,2,FALSE),0)","v":0},{"$f":"IFERROR(VLOOKUP(C159,ELIST!$A$2:$E$300,5,FALSE),0)","v":0}]
["000000001002471933","Integrated VT Oil Indoor","VT_INTVT","Integrated VT",{"$f":"IFERROR(VLOOKUP(C160,ELIST!$A$2:$E$300,2,FALSE),0)","v":0},{"$f":"IFERROR(VLOOKUP(C160,ELIST!$A$2:$E$300,5,FALSE),0)","v":0}]
["000000001002471934","Integrated VT SF6 Outdoor","VT_INTVT","Integrated VT",{"$f":"IFERROR(VLOOKUP(C161,ELIST!$A$2:$E$300,2,FALSE),0)","v":0},{"$f":"IFERROR(VLOOKUP(C161,ELIST!$A$2:$E$300,5,FALSE),0)","v":0}]
["000000001002471935","Integrated VT SF6 Indoor","VT_INTVT","Integrated VT",{"$f":"IFERROR(VLOOKUP(C162,ELIST!$A$2:$E$300,2,FALSE),0)","v":0},{"$f":"IFERROR(VLOOKUP(C162,ELIST!$A$2:$E$300,5,FALSE),0)","v":0}]
["000000001002471936","Integrated VT Epoxy Outdoor","VT_INTVT","Integrated VT",{"$f":"IFERROR(VLOOKUP(C163,ELIST!$A$2:$E$300,2,FALSE),0)","v":0},{"$f":"IFERROR(VLOOKUP(C163,ELIST!$A$2:$E$300,5,FALSE),0)","v":0}]
["000000001002471937","Integrated VT Epoxy Indoor","VT_INTVT","Integrated VT",{"$f":"IFERROR(VLOOKUP(C164,ELIST!$A$2:$E$300,2,FALSE),0)","v":0},{"$f":"IFERROR(VLOOKUP(C164,ELIST!$A$2:$E$300,5,FALSE),0)","v":0}]
["000000001002471938","Integrated VT GIS Outdoor","VT_INTVT","Integrated VT",{"$f":"IFERROR(VLOOKUP(C165,ELIST!$A$2:$E$300,2,FALSE),0)","v":0},{"$f":"IFERROR(VLOOKUP(C165,ELIST!$A$2:$E$300,5,FALSE),0)","v":0}]
["000000001002471939","Integrated VT GIS Indoor","VT_INTVT","Integrated VT",{"$f":"IFERROR(VLOOKUP(C166,ELIST!$A$2:$E$300,2,FALSE),0)","v":0},{"$f":"IFERROR(VLOOKUP(C166,ELIST!$A$2:$E$300,5,FALSE),0)","v":0}]
["000000001002471942","Gen, Trans Isolator","TE_ISOL","Trans Isolator",{"$f":"IFERROR(VLOOKUP(C167,ELIST!$A$2:$E$300,2,FALSE),0)","v":0},{"$f":"IFERROR(VLOOKUP(C167,ELIST!$A$2:$E$300,5,FALSE),0)","v":0}]
["000000001002471943","Gen, Isolation Trf","TX_ISOLTX","Isolation Trf",{"$f":"IFERROR(VLOOKUP(C168,ELIST!$A$2:$E$300,2,FALSE),0)","v":0},{"$f":"IFERROR(VLOOKUP(C168,ELIST!$A$2:$E$300,5,FALSE),0)","v":0}]
["000000001002471944","Isolation Transformer Oil","TX_ISOLTX","Isolation Trf",{"$f":"IFERROR(VLOOKUP(C169,ELIST!$A$2:$E$300,2,FALSE),0)","v":0},{"$f":"IFERROR(VLOOKUP(C169,ELIST!$A$2:$E$300,5,FALSE),0)","v":0}]
["000000001002471945","Isolation Transformer Air","TX_ISOLTX","Isolation Trf",{"$f":"IFERROR(VLOOKUP(C170,ELIST!$A$2:$E$300,2,FALSE),0)","v":0},{"$f":"IFERROR(VLOOKUP(C170,ELIST!$A$2:$E$300,5,FALSE),0)","v":0}]
["000000001002471946","Gen, IT - Cable","HW_ITCBLE","IT Cable",{"$f":"IFERROR(VLOOKUP(C171,ELIST!$A$2:$E$300,2,FALSE),0)","v":0},{"$f":"IFERROR(VLOOKUP(C171,ELIST!$A$2:$E$300,5,FALSE),0)","v":0}]
["000000001002471947","Gen, IT Power Supply","HW_ITPSUP","IT Power Supply",{"$f":"IFERROR(VLOOKUP(C172,ELIST!$A$2:$E$300,2,FALSE),0)","v":0},{"$f":"IFERROR(VLOOKUP(C172,ELIST!$A$2:$E$300,5,FALSE),0)","v":0}]
["000000001002471948","Gen, Crane - Jib","CN_JIBCN","Crane - Jib",{"$f":"IFERROR(VLOOKUP(C173,ELIST!$A$2:$E$300,2,FALSE),0)","v":0},{"$f":"IFERROR(VLOOKUP(C173,ELIST!$A$2:$E$300,5,FALSE),0)","v":0}]
["000000001002471951","Gen, Ladder and Platform","HS_LADDER","Ladder and Platform",{"$f":"IFERROR(VLOOKUP(C174,ELIST!$A$2:$E$300,2,FALSE),0)","v":0},{"$f":"IFERROR(VLOOKUP(C174,ELIST!$A$2:$E$300,5,FALSE),0)","v":0}]
["000000001002471952","Gen, Ladder Fixing Point","HS_LADDFP","Ladder Fixing Point",{"$f":"IFERROR(VLOOKUP(C175,ELIST!$A$2:$E$300,2,FALSE),0)","v":0},{"$f":"IFERROR(VLOOKUP(C175,ELIST!$A$2:$E$300,5,FALSE),0)","v":0}]
["000000001002471953","Gen, PC Laptop","HW_LAPTOP","PC Laptop",{"$f":"IFERROR(VLOOKUP(C176,ELIST!$A$2:$E$300,2,FALSE),0)","v":0},{"$f":"IFERROR(VLOOKUP(C176,ELIST!$A$2:$E$300,5,FALSE),0)","v":0}]
["000000001002471957","Gen, Light Commercial","FL_LC","Light Commercial",{"$f":"IFERROR(VLOOKUP(C177,ELIST!$A$2:$E$300,2,FALSE),0)","v":0},{"$f":"IFERROR(VLOOKUP(C177,ELIST!$A$2:$E$300,5,FALSE),0)","v":0}]
["000000001002471958","Light Vehcl 4X2 Drve","FL_LC","Light Commercial",{"$f":"IFERROR(VLOOKUP(C178,ELIST!$A$2:$E$300,2,FALSE),0)","v":0},{"$f":"IFERROR(VLOOKUP(C178,ELIST!$A$2:$E$300,5,FALSE),0)","v":0}]
["000000001002471959","Light Vehcl AWD Wagn","FL_LC","Light Commercial",{"$f":"IFERROR(VLOOKUP(C179,ELIST!$A$2:$E$300,2,FALSE),0)","v":0},{"$f":"IFERROR(VLOOKUP(C179,ELIST!$A$2:$E$300,5,FALSE),0)","v":0}]
["000000001002471960","Light Vehcl Hatch","FL_LC","Light Commercial",{"$f":"IFERROR(VLOOKUP(C180,ELIST!$A$2:$E$300,2,FALSE),0)","v":0},{"$f":"IFERROR(VLOOKUP(C180,ELIST!$A$2:$E$300,5,FALSE),0)","v":0}]
["000000001002471961","Light Vehcl Lrge Van","FL_LC","Light Commercial",{"$f":"IFERROR(VLOOKUP(C181,ELIST!$A$2:$E$300,2,FALSE),0)","v":0},{"$f":"IFERROR(VLOOKUP(C181,ELIST!$A$2:$E$300,5,FALSE),0)","v":0}]
["000000001002471962","Light Vehcl Medm Van","FL_LC","Light Commercial",{"$f":"IFERROR(VLOOKUP(C182,ELIST!$A$2:$E$300,2,FALSE),0)","v":0},{"$f":"IFERROR(VLOOKUP(C182,ELIST!$A$2:$E$300,5,FALSE),0)","v":0}]
["000000001002471963","Light Vehcl Wagon","FL_LC","Light Commercial",{"$f":"IFERROR(VLOOKUP(C183,ELIST!$A$2:$E$300,2,FALSE),0)","v":0},{"$f":"IFERROR(VLOOKUP(C183,ELIST!$A$2:$E$300,5,FALSE),0)","v":0}]
["000000001002471964","Gen, Line Fault Indicator","FI_LFI","Line Fault Indicator",{"$f":"IFERROR(VLOOKUP(C184,ELIST!$A$2:$E$300,2,FALSE),0)","v":0},{"$f":"IFERROR(VLOOKUP(C184,ELIST!$A$2:$E$300,5,FALSE),0)","v":0}]
["000000001002471965","Line Fault Iindicators - PL Mounted","FI_LFI","Line Fault Indicator",{"$f":"IFERROR(VLOOKUP(C185,ELIST!$A$2:$E$300,2,FALSE),0)","v":0},{"$f":"IFERROR(VLOOKUP(C185,ELIST!$A$2:$E$300,5,FALSE),0)","v":0}]
["000000001002471966","Gen, Lightning Mast","CV_LGTNMT","Lightning Mast",{"$f":"IFERROR(VLOOKUP(C186,ELIST!$A$2:$E$300,2,FALSE),0)","v":0},{"$f":"IFERROR(VLOOKUP(C186,ELIST!$A$2:$E$300,5,FALSE),0)","v":0}]
["000000001002471967","Gen, Lighting Tower","CV_LGTTWR","Lighting Tower",{"$f":"IFERROR(VLOOKUP(C187,ELIST!$A$2:$E$300,2,FALSE),0)","v":0},{"$f":"IFERROR(VLOOKUP(C187,ELIST!$A$2:$E$300,5,FALSE),0)","v":0}]
["000000001002471968","Gen, Lift","LF_LIFT","Lift Personnel",{"$f":"IFERROR(VLOOKUP(C188,ELIST!$A$2:$E$300,2,FALSE),0)","v":0},{"$f":"IFERROR(VLOOKUP(C188,ELIST!$A$2:$E$300,5,FALSE),0)","v":0}]
["000000001002471972","Gen, Trans Links","TE_LINKS","Trans Links",{"$f":"IFERROR(VLOOKUP(C189,ELIST!$A$2:$E$300,2,FALSE),0)","v":0},{"$f":"IFERROR(VLOOKUP(C189,ELIST!$A$2:$E$300,5,FALSE),0)","v":0}]
["000000001002471973","Gen, Lunch Room","CV_LNCHRM","Lunch Room",{"$f":"IFERROR(VLOOKUP(C190,ELIST!$A$2:$E$300,2,FALSE),0)","v":0},{"$f":"IFERROR(VLOOKUP(C190,ELIST!$A$2:$E$300,5,FALSE),0)","v":0}]
["000000001002471974","Gen, Landing Span/Gantry","CV_LNDSPN","Landing Span/Gantry",{"$f":"IFERROR(VLOOKUP(C191,ELIST!$A$2:$E$300,2,FALSE),0)","v":0},{"$f":"IFERROR(VLOOKUP(C191,ELIST!$A$2:$E$300,5,FALSE),0)","v":0}]
["000000001002471975","Gen, Live Tank CB","CB_LTKCB","Live Tank CB",{"$f":"IFERROR(VLOOKUP(C192,ELIST!$A$2:$E$300,2,FALSE),0)","v":0},{"$f":"IFERROR(VLOOKUP(C192,ELIST!$A$2:$E$300,5,FALSE),0)","v":0}]
["000000001002471976","Gen, SF6 Circuit Breaker","CB_LTKCB","Live Tank CB",{"$f":"IFERROR(VLOOKUP(C193,ELIST!$A$2:$E$300,2,FALSE),0)","v":0},{"$f":"IFERROR(VLOOKUP(C193,ELIST!$A$2:$E$300,5,FALSE),0)","v":0}]
["000000001002471977","Gen, Vacuum Circuit Breaker","CB_LTKCB","Live Tank CB",{"$f":"IFERROR(VLOOKUP(C194,ELIST!$A$2:$E$300,2,FALSE),0)","v":0},{"$f":"IFERROR(VLOOKUP(C194,ELIST!$A$2:$E$300,5,FALSE),0)","v":0}]
["000000001002471978","Gen, Bulk Oil CB","CB_LTKCB","Live Tank CB",{"$f":"IFERROR(VLOOKUP(C195,ELIST!$A$2:$E$300,2,FALSE),0)","v":0},{"$f":"IFERROR(VLOOKUP(C195,ELIST!$A$2:$E$300,5,FALSE),0)","v":0}]
["000000001002471979","Gen, Small Oil CB","CB_LTKCB","Live Tank CB",{"$f":"IFERROR(VLOOKUP(C196,ELIST!$A$2:$E$300,2,FALSE),0)","v":0},{"$f":"IFERROR(VLOOKUP(C196,ELIST!$A$2:$E$300,5,FALSE),0)","v":0}]
["000000001002471980","Gen, Night Watch Lantern","NW_LTRNNW","Night Watch Lantern",{"$f":"IFERROR(VLOOKUP(C197,ELIST!$A$2:$E$300,2,FALSE),0)","v":0},{"$f":"IFERROR(VLOOKUP(C197,ELIST!$A$2:$E$300,5,FALSE),0)","v":0}]
["000000001002471996","Gen, LV Link Box","SW_LVLKBX","LV Link Box",{"$f":"IFERROR(VLOOKUP(C198,ELIST!$A$2:$E$300,2,FALSE),0)","v":0},{"$f":"IFERROR(VLOOKUP(C198,ELIST!$A$2:$E$300,5,FALSE),0)","v":0}]
["000000001002471997","Gen, Low Voltage Rescue Kit","CV_LVRESK","LV Rescue Kit",{"$f":"IFERROR(VLOOKUP(C199,ELIST!$A$2:$E$300,2,FALSE),0)","v":0},{"$f":"IFERROR(VLOOKUP(C199,ELIST!$A$2:$E$300,5,FALSE),0)","v":0}]
["000000001002471998","Gen, Microwave","CM_MCRWV","Microwave",{"$f":"IFERROR(VLOOKUP(C200,ELIST!$A$2:$E$300,2,FALSE),0)","v":0},{"$f":"IFERROR(VLOOKUP(C200,ELIST!$A$2:$E$300,5,FALSE),0)","v":0}]
["000000001002471999","Gen, Modular Building","CV_MDBLDG","Modular Building",{"$f":"IFERROR(VLOOKUP(C201,ELIST!$A$2:$E$300,2,FALSE),0)","v":0},{"$f":"IFERROR(VLOOKUP(C201,ELIST!$A$2:$E$300,5,FALSE),0)","v":0}]
["000000001002472000","Gen, Max Demand Indicator","SE_MDI","Max Demand Indicator",{"$f":"IFERROR(VLOOKUP(C202,ELIST!$A$2:$E$300,2,FALSE),0)","v":0},{"$f":"IFERROR(VLOOKUP(C202,ELIST!$A$2:$E$300,5,FALSE),0)","v":0}]
["000000001002472001","Miscellaneous Tool","TO_MISCTL","Miscellaneous Tool",{"$f":"IFERROR(VLOOKUP(C203,ELIST!$A$2:$E$300,2,FALSE),0)","v":0},{"$f":"IFERROR(VLOOKUP(C203,ELIST!$A$2:$E$300,5,FALSE),0)","v":0}]
["000000001002472002","Gen, Multiplexer","HW_MLTIPL","Multiplexer",{"$f":"IFERROR(VLOOKUP(C204,ELIST!$A$2:$E$300,2,FALSE),0)","v":0},{"$f":"IFERROR(VLOOKUP(C204,ELIST!$A$2:$E$300,5,FALSE),0)","v":0}]
["000000001002472003","Gen, Mobile Phone","HW_MOBILE","Mobile Phone",{"$f":"IFERROR(VLOOKUP(C205,ELIST!$A$2:$E$300,2,FALSE),0)","v":0},{"$f":"IFERROR(VLOOKUP(C205,ELIST!$A$2:$E$300,5,FALSE),0)","v":0}]
["000000001002472004","Gen, Modem","HW_MODEM","Modem",{"$f":"IFERROR(VLOOKUP(C206,ELIST!$A$2:$E$300,2,FALSE),0)","v":0},{"$f":"IFERROR(VLOOKUP(C206,ELIST!$A$2:$E$300,5,FALSE),0)","v":0}]
["000000001002472005","Gen, 3G/4G Modem","CM_MODEMM","3G/4G Modem",{"$f":"IFERROR(VLOOKUP(C207,ELIST!$A$2:$E$300,2,FALSE),0)","v":0},{"$f":"IFERROR(VLOOKUP(C207,ELIST!$A$2:$E$300,5,FALSE),0)","v":0}]
["000000001002472006","Gen, Monitor","HW_MONITR","Monitor",{"$f":"IFERROR(VLOOKUP(C208,ELIST!$A$2:$E$300,2,FALSE),0)","v":0},{"$f":"IFERROR(VLOOKUP(C208,ELIST!$A$2:$E$300,5,FALSE),0)","v":0}]
["000000001002472007","Gen, MPLS","CM_MPLS","MPLS",{"$f":"IFERROR(VLOOKUP(C209,ELIST!$A$2:$E$300,2,FALSE),0)","v":0},{"$f":"IFERROR(VLOOKUP(C209,ELIST!$A$2:$E$300,5,FALSE),0)","v":0}]
["000000001002472008","Gen, Mobile Radio","HW_MRADIO","Mobile Radio",{"$f":"IFERROR(VLOOKUP(C210,ELIST!$A$2:$E$300,2,FALSE),0)","v":0},{"$f":"IFERROR(VLOOKUP(C210,ELIST!$A$2:$E$300,5,FALSE),0)","v":0}]
["000000001002472009","Gen, Main Switch Board","SB_MSB","Main Switch Board",{"$f":"IFERROR(VLOOKUP(C211,ELIST!$A$2:$E$300,2,FALSE),0)","v":0},{"$f":"IFERROR(VLOOKUP(C211,ELIST!$A$2:$E$300,5,FALSE),0)","v":0}]
["000000001002472010","Gen, Metal Enclosure","CV_MTLENC","Metal Enclosure",{"$f":"IFERROR(VLOOKUP(C212,ELIST!$A$2:$E$300,2,FALSE),0)","v":0},{"$f":"IFERROR(VLOOKUP(C212,ELIST!$A$2:$E$300,5,FALSE),0)","v":0}]
["000000001002472011","Gen, Motor Box","MB_MTRBOX","Motor Box",{"$f":"IFERROR(VLOOKUP(C213,ELIST!$A$2:$E$300,2,FALSE),0)","v":0},{"$f":"IFERROR(VLOOKUP(C213,ELIST!$A$2:$E$300,5,FALSE),0)","v":0}]
["000000001002472012","Gen, Metering CT","CT_MTRCT","Metering CT",{"$f":"IFERROR(VLOOKUP(C214,ELIST!$A$2:$E$300,2,FALSE),0)","v":0},{"$f":"IFERROR(VLOOKUP(C214,ELIST!$A$2:$E$300,5,FALSE),0)","v":0}]
["000000001002472013","Gen, Motor Generator Set","AF_MTRGEN","Motor Generator Set",{"$f":"IFERROR(VLOOKUP(C215,ELIST!$A$2:$E$300,2,FALSE),0)","v":0},{"$f":"IFERROR(VLOOKUP(C215,ELIST!$A$2:$E$300,5,FALSE),0)","v":0}]
["000000001002472014","Gen, Navigator","HW_NAVIGT","Navigator",{"$f":"IFERROR(VLOOKUP(C216,ELIST!$A$2:$E$300,2,FALSE),0)","v":0},{"$f":"IFERROR(VLOOKUP(C216,ELIST!$A$2:$E$300,5,FALSE),0)","v":0}]
["000000001002472015","Gen, Neutral Earth CT","CT_NERCT","Neutral Earth CT",{"$f":"IFERROR(VLOOKUP(C217,ELIST!$A$2:$E$300,2,FALSE),0)","v":0},{"$f":"IFERROR(VLOOKUP(C217,ELIST!$A$2:$E$300,5,FALSE),0)","v":0}]
["000000001002472016","Neutral Earth CT 33kV BMW Elect","CT_NERCT","Neutral Earth CT",{"$f":"IFERROR(VLOOKUP(C218,ELIST!$A$2:$E$300,2,FALSE),0)","v":0},{"$f":"IFERROR(VLOOKUP(C218,ELIST!$A$2:$E$300,5,FALSE),0)","v":0}]
["000000001002472017","Neutral Earth CT 33kV Hanson","CT_NERCT","Neutral Earth CT",{"$f":"IFERROR(VLOOKUP(C219,ELIST!$A$2:$E$300,2,FALSE),0)","v":0},{"$f":"IFERROR(VLOOKUP(C219,ELIST!$A$2:$E$300,5,FALSE),0)","v":0}]
["000000001002472018","Neutral Earth CT 132kV Hanson","CT_NERCT","Neutral Earth CT",{"$f":"IFERROR(VLOOKUP(C220,ELIST!$A$2:$E$300,2,FALSE),0)","v":0},{"$f":"IFERROR(VLOOKUP(C220,ELIST!$A$2:$E$300,5,FALSE),0)","v":0}]
["000000001002472019","Gen, Neutral Erth Reactor","RE_NEREAC","Neutral Erth Reactor",{"$f":"IFERROR(VLOOKUP(C221,ELIST!$A$2:$E$300,2,FALSE),0)","v":0},{"$f":"IFERROR(VLOOKUP(C221,ELIST!$A$2:$E$300,5,FALSE),0)","v":0}]
["000000001002472020","Gen, Neutral Erth Resistor","RE_NERES","Neut Erth Resistor",{"$f":"IFERROR(VLOOKUP(C222,ELIST!$A$2:$E$300,2,FALSE),0)","v":0},{"$f":"IFERROR(VLOOKUP(C222,ELIST!$A$2:$E$300,5,FALSE),0)","v":0}]
["000000001002472021","Gen, Network Hub","HW_NETHUB","Network Hub",{"$f":"IFERROR(VLOOKUP(C223,ELIST!$A$2:$E$300,2,FALSE),0)","v":0},{"$f":"IFERROR(VLOOKUP(C223,ELIST!$A$2:$E$300,5,FALSE),0)","v":0}]
["000000001002472022","Gen, Scada Network Switch","SC_NETSW","Scada Network Switch",{"$f":"IFERROR(VLOOKUP(C224,ELIST!$A$2:$E$300,2,FALSE),0)","v":0},{"$f":"IFERROR(VLOOKUP(C224,ELIST!$A$2:$E$300,5,FALSE),0)","v":0}]
["000000001002472023","Gen, Noise Wall","CV_NOIWLL","Noise Wall",{"$f":"IFERROR(VLOOKUP(C225,ELIST!$A$2:$E$300,2,FALSE),0)","v":0},{"$f":"IFERROR(VLOOKUP(C225,ELIST!$A$2:$E$300,5,FALSE),0)","v":0}]
["000000001002472024","Gen, Neutral Unbalance CT","CT_NUBCT","Neutral Unbalance CT",{"$f":"IFERROR(VLOOKUP(C226,ELIST!$A$2:$E$300,2,FALSE),0)","v":0},{"$f":"IFERROR(VLOOKUP(C226,ELIST!$A$2:$E$300,5,FALSE),0)","v":0}]
["000000001002472025","Gen, OC/EF/SEF Prot Relay","PR_OCEFPR","OC/EF/SEF Prot Relay",{"$f":"IFERROR(VLOOKUP(C227,ELIST!$A$2:$E$300,2,FALSE),0)","v":0},{"$f":"IFERROR(VLOOKUP(C227,ELIST!$A$2:$E$300,5,FALSE),0)","v":0}]
["000000001002472026","Gen, Outdoor Capacitor","CU_ODCAP","Outdoor Capacitor",{"$f":"IFERROR(VLOOKUP(C228,ELIST!$A$2:$E$300,2,FALSE),0)","v":0},{"$f":"IFERROR(VLOOKUP(C228,ELIST!$A$2:$E$300,5,FALSE),0)","v":0}]
["000000001002472027","Gen, Outdoor Enclosed Cap","CU_ODECAP","Outdoor Enclosed Cap",{"$f":"IFERROR(VLOOKUP(C229,ELIST!$A$2:$E$300,2,FALSE),0)","v":0},{"$f":"IFERROR(VLOOKUP(C229,ELIST!$A$2:$E$300,5,FALSE),0)","v":0}]
["000000001002472028","Gen, OH Consumer Mains","FD_OHCONM","OH Consumer Mains",{"$f":"IFERROR(VLOOKUP(C230,ELIST!$A$2:$E$300,2,FALSE),0)","v":0},{"$f":"IFERROR(VLOOKUP(C230,ELIST!$A$2:$E$300,5,FALSE),0)","v":0}]
["000000001002472029","Gen, Oil Separator","CV_OILSEP","Oil Water Separator",{"$f":"IFERROR(VLOOKUP(C231,ELIST!$A$2:$E$300,2,FALSE),0)","v":0},{"$f":"IFERROR(VLOOKUP(C231,ELIST!$A$2:$E$300,5,FALSE),0)","v":0}]
["000000001002472030","Oil Water Separator","CV_OILSEP","Oil Water Separator",{"$f":"IFERROR(VLOOKUP(C232,ELIST!$A$2:$E$300,2,FALSE),0)","v":0},{"$f":"IFERROR(VLOOKUP(C232,ELIST!$A$2:$E$300,5,FALSE),0)","v":0}]
["000000001002472031","Gen, Oil Spray Wall","CV_OILWLL","Oil Spray Wall",{"$f":"IFERROR(VLOOKUP(C233,ELIST!$A$2:$E$300,2,FALSE),0)","v":0},{"$f":"IFERROR(VLOOKUP(C233,ELIST!$A$2:$E$300,5,FALSE),0)","v":0}]
["000000001002472033","Gen, Other Device","SC_OTHDV","Other Device",{"$f":"IFERROR(VLOOKUP(C234,ELIST!$A$2:$E$300,2,FALSE),0)","v":0},{"$f":"IFERROR(VLOOKUP(C234,ELIST!$A$2:$E$300,5,FALSE),0)","v":0}]
["000000001002472035","Gen, Oven","CE_OVEN","Oven",{"$f":"IFERROR(VLOOKUP(C235,ELIST!$A$2:$E$300,2,FALSE),0)","v":0},{"$f":"IFERROR(VLOOKUP(C235,ELIST!$A$2:$E$300,5,FALSE),0)","v":0}]
["000000001002472052","Gen, Personal Access Gate","CV_PAGATE","Personal Access Gate",{"$f":"IFERROR(VLOOKUP(C236,ELIST!$A$2:$E$300,2,FALSE),0)","v":0},{"$f":"IFERROR(VLOOKUP(C236,ELIST!$A$2:$E$300,5,FALSE),0)","v":0}]
["000000001002472053","Gen, Crane Borer","FL_PB","Crane Borer",{"$f":"IFERROR(VLOOKUP(C237,ELIST!$A$2:$E$300,2,FALSE),0)","v":0},{"$f":"IFERROR(VLOOKUP(C237,ELIST!$A$2:$E$300,5,FALSE),0)","v":0}]
["000000001002472054","Gen, Crane Truck Mounted","FL_PC","VehicleLoading Crane",{"$f":"IFERROR(VLOOKUP(C238,ELIST!$A$2:$E$300,2,FALSE),0)","v":0},{"$f":"IFERROR(VLOOKUP(C238,ELIST!$A$2:$E$300,5,FALSE),0)","v":0}]
["000000001002472055","Gen, Vehicle Loading Crane","FL_PC","VehicleLoading Crane",{"$f":"IFERROR(VLOOKUP(C239,ELIST!$A$2:$E$300,2,FALSE),0)","v":0},{"$f":"IFERROR(VLOOKUP(C239,ELIST!$A$2:$E$300,5,FALSE),0)","v":0}]
["000000001002472056","Gen, Tool Petrol Powered","TO_PETROL","Tool Petrol Powered",{"$f":"IFERROR(VLOOKUP(C240,ELIST!$A$2:$E$300,2,FALSE),0)","v":0},{"$f":"IFERROR(VLOOKUP(C240,ELIST!$A$2:$E$300,5,FALSE),0)","v":0}]
["000000001002472057","Gen, Forklift","FL_PF","Forklift",{"$f":"IFERROR(VLOOKUP(C241,ELIST!$A$2:$E$300,2,FALSE),0)","v":0},{"$f":"IFERROR(VLOOKUP(C241,ELIST!$A$2:$E$300,5,FALSE),0)","v":0}]
["000000001002472058","Gen, Perimeter Fence","CV_PFENCE","Perimeter Fence",{"$f":"IFERROR(VLOOKUP(C242,ELIST!$A$2:$E$300,2,FALSE),0)","v":0},{"$f":"IFERROR(VLOOKUP(C242,ELIST!$A$2:$E$300,5,FALSE),0)","v":0}]
["000000001002472059","Gen, Land Line Phone","HW_PHONLL","Land Line Phone",{"$f":"IFERROR(VLOOKUP(C243,ELIST!$A$2:$E$300,2,FALSE),0)","v":0},{"$f":"IFERROR(VLOOKUP(C243,ELIST!$A$2:$E$300,5,FALSE),0)","v":0}]
["000000001002472063","Gen, Pit","PI_PIT","Pit",{"$f":"IFERROR(VLOOKUP(C244,ELIST!$A$2:$E$300,2,FALSE),0)","v":0},{"$f":"IFERROR(VLOOKUP(C244,ELIST!$A$2:$E$300,5,FALSE),0)","v":0}]
["000000001002472064","Gen, Pole Capacitor Bank","CU_PLCPBK","Pole Capacitor Bank",{"$f":"IFERROR(VLOOKUP(C245,ELIST!$A$2:$E$300,2,FALSE),0)","v":0},{"$f":"IFERROR(VLOOKUP(C245,ELIST!$A$2:$E$300,5,FALSE),0)","v":0}]
["000000001002472067","Gen, Plug-in Termination","TE_PLUGIN","Plug-in Termination",{"$f":"IFERROR(VLOOKUP(C246,ELIST!$A$2:$E$300,2,FALSE),0)","v":0},{"$f":"IFERROR(VLOOKUP(C246,ELIST!$A$2:$E$300,5,FALSE),0)","v":0}]
["000000001002472068","Gen, Plate Warmer","CE_PLWARM","Plate Warmer",{"$f":"IFERROR(VLOOKUP(C247,ELIST!$A$2:$E$300,2,FALSE),0)","v":0},{"$f":"IFERROR(VLOOKUP(C247,ELIST!$A$2:$E$300,5,FALSE),0)","v":0}]
["000000001002472069","Gen, Tools Pneumatic Pwrd","TO_PNEUMT","Tools Pneumatic Pwrd",{"$f":"IFERROR(VLOOKUP(C248,ELIST!$A$2:$E$300,2,FALSE),0)","v":0},{"$f":"IFERROR(VLOOKUP(C248,ELIST!$A$2:$E$300,5,FALSE),0)","v":0}]
["000000001002472070","Gen, Tools Portable Earth","TO_PORERT","Tools Portable Earth",{"$f":"IFERROR(VLOOKUP(C249,ELIST!$A$2:$E$300,2,FALSE),0)","v":0},{"$f":"IFERROR(VLOOKUP(C249,ELIST!$A$2:$E$300,5,FALSE),0)","v":0}]
["000000001002472071","Gen, Portable Ladder","TO_PORTLD","Portable Ladder",{"$f":"IFERROR(VLOOKUP(C250,ELIST!$A$2:$E$300,2,FALSE),0)","v":0},{"$f":"IFERROR(VLOOKUP(C250,ELIST!$A$2:$E$300,5,FALSE),0)","v":0}]
["000000001002472072","Extension Ladder","TO_PORTLD","Portable Ladder",{"$f":"IFERROR(VLOOKUP(C251,ELIST!$A$2:$E$300,2,FALSE),0)","v":0},{"$f":"IFERROR(VLOOKUP(C251,ELIST!$A$2:$E$300,5,FALSE),0)","v":0}]
["000000001002472073","Step Ladder","TO_PORTLD","Portable Ladder",{"$f":"IFERROR(VLOOKUP(C252,ELIST!$A$2:$E$300,2,FALSE),0)","v":0},{"$f":"IFERROR(VLOOKUP(C252,ELIST!$A$2:$E$300,5,FALSE),0)","v":0}]
["000000001002472074","Gen, Post Magnetic CT","CT_POSTCT","Post CT",{"$f":"IFERROR(VLOOKUP(C253,ELIST!$A$2:$E$300,2,FALSE),0)","v":0},{"$f":"IFERROR(VLOOKUP(C253,ELIST!$A$2:$E$300,5,FALSE),0)","v":0}]
["000000001002472075","Gen, Post Magnetic VT","VT_POSTVT","Post Magnetic VT",{"$f":"IFERROR(VLOOKUP(C254,ELIST!$A$2:$E$300,2,FALSE),0)","v":0},{"$f":"IFERROR(VLOOKUP(C254,ELIST!$A$2:$E$300,5,FALSE),0)","v":0}]
["000000001002472076","Post Magnetic VT Oil Outdoor","VT_POSTVT","Post Magnetic VT",{"$f":"IFERROR(VLOOKUP(C255,ELIST!$A$2:$E$300,2,FALSE),0)","v":0},{"$f":"IFERROR(VLOOKUP(C255,ELIST!$A$2:$E$300,5,FALSE),0)","v":0}]
["000000001002472077","Post Magnetic VT Oil Indoor","VT_POSTVT","Post Magnetic VT",{"$f":"IFERROR(VLOOKUP(C256,ELIST!$A$2:$E$300,2,FALSE),0)","v":0},{"$f":"IFERROR(VLOOKUP(C256,ELIST!$A$2:$E$300,5,FALSE),0)","v":0}]
["000000001002472078","Post Magnetic VT SF6 Outdoor","VT_POSTVT","Post Magnetic VT",{"$f":"IFERROR(VLOOKUP(C257,ELIST!$A$2:$E$300,2,FALSE),0)","v":0},{"$f":"IFERROR(VLOOKUP(C257,ELIST!$A$2:$E$300,5,FALSE),0)","v":0}]
["000000001002472079","Post Magnetic VT SF6 Indoor","VT_POSTVT","Post Magnetic VT",{"$f":"IFERROR(VLOOKUP(C258,ELIST!$A$2:$E$300,2,FALSE),0)","v":0},{"$f":"IFERROR(VLOOKUP(C258,ELIST!$A$2:$E$300,5,FALSE),0)","v":0}]
["000000001002472080","Post Magnetic VT Epoxy Outdoor","VT_POSTVT","Post Magnetic VT",{"$f":"IFERROR(VLOOKUP(C259,ELIST!$A$2:$E$300,2,FALSE),0)","v":0},{"$f":"IFERROR(VLOOKUP(C259,ELIST!$A$2:$E$300,5,FALSE),0)","v":0}]
["000000001002472081","Post Magnetic VT Epoxy Indoor","VT_POSTVT","Post Magnetic VT",{"$f":"IFERROR(VLOOKUP(C260,ELIST!$A$2:$E$300,2,FALSE),0)","v":0},{"$f":"IFERROR(VLOOKUP(C260,ELIST!$A$2:$E$300,5,FALSE),0)","v":0}]
["000000001002472082","Post Magnetic VT GIS Outdoor","VT_POSTVT","Post Magnetic VT",{"$f":"IFERROR(VLOOKUP(C261,ELIST!$A$2:$E$300,2,FALSE),0)","v":0},{"$f":"IFERROR(VLOOKUP(C261,ELIST!$A$2:$E$300,5,FALSE),0)","v":0}]
["000000001002472083","Post Magnetic VT GIS Indoor","VT_POSTVT","Post Magnetic VT",{"$f":"IFERROR(VLOOKUP(C262,ELIST!$A$2:$E$300,2,FALSE),0)","v":0},{"$f":"IFERROR(VLOOKUP(C262,ELIST!$A$2:$E$300,5,FALSE),0)","v":0}]
["000000001002472084","Gen, VT Primary Fuse","VT_PRIMFS","VT Primary Fuse",{"$f":"IFERROR(VLOOKUP(C263,ELIST!$A$2:$E$300,2,FALSE),0)","v":0},{"$f":"IFERROR(VLOOKUP(C263,ELIST!$A$2:$E$300,5,FALSE),0)","v":0}]
["000000001002472085","Gen, VT Primary Link","VT_PRIMLK","VT Primary Link",{"$f":"IFERROR(VLOOKUP(C264,ELIST!$A$2:$E$300,2,FALSE),0)","v":0},{"$f":"IFERROR(VLOOKUP(C264,ELIST!$A$2:$E$300,5,FALSE),0)","v":0}]
["000000001002472086","Gen, Printer","HW_PRINTR","Printer",{"$f":"IFERROR(VLOOKUP(C265,ELIST!$A$2:$E$300,2,FALSE),0)","v":0},{"$f":"IFERROR(VLOOKUP(C265,ELIST!$A$2:$E$300,5,FALSE),0)","v":0}]
["000000001002472087","Gen, Crane - Portal","CN_PRTLCN","Crane - Portal",{"$f":"IFERROR(VLOOKUP(C266,ELIST!$A$2:$E$300,2,FALSE),0)","v":0},{"$f":"IFERROR(VLOOKUP(C266,ELIST!$A$2:$E$300,5,FALSE),0)","v":0}]
["000000001002472088","Gen, Pressure Washer","TO_PRWSHR","Pressure Washer",{"$f":"IFERROR(VLOOKUP(C267,ELIST!$A$2:$E$300,2,FALSE),0)","v":0},{"$f":"IFERROR(VLOOKUP(C267,ELIST!$A$2:$E$300,5,FALSE),0)","v":0}]
["000000001002472089","Gen, Trailer","FL_PT","Trailer",{"$f":"IFERROR(VLOOKUP(C268,ELIST!$A$2:$E$300,2,FALSE),0)","v":0},{"$f":"IFERROR(VLOOKUP(C268,ELIST!$A$2:$E$300,5,FALSE),0)","v":0}]
["000000001002472090","Gen, Cable Trailer","FL_PT","Trailer",{"$f":"IFERROR(VLOOKUP(C269,ELIST!$A$2:$E$300,2,FALSE),0)","v":0},{"$f":"IFERROR(VLOOKUP(C269,ELIST!$A$2:$E$300,5,FALSE),0)","v":0}]
["000000001002472091","Gen, Erth Drll Equip Trlr","FL_PT","Trailer",{"$f":"IFERROR(VLOOKUP(C270,ELIST!$A$2:$E$300,2,FALSE),0)","v":0},{"$f":"IFERROR(VLOOKUP(C270,ELIST!$A$2:$E$300,5,FALSE),0)","v":0}]
["000000001002472092","Gen, Forklift Trailer","FL_PT","Trailer",{"$f":"IFERROR(VLOOKUP(C271,ELIST!$A$2:$E$300,2,FALSE),0)","v":0},{"$f":"IFERROR(VLOOKUP(C271,ELIST!$A$2:$E$300,5,FALSE),0)","v":0}]
["000000001002472093","Gen, Prtctn & Cntrl Trlr","FL_PT","Trailer",{"$f":"IFERROR(VLOOKUP(C272,ELIST!$A$2:$E$300,2,FALSE),0)","v":0},{"$f":"IFERROR(VLOOKUP(C272,ELIST!$A$2:$E$300,5,FALSE),0)","v":0}]
["000000001002472094","Gen, Wood Chipper Trailer","FL_PT","Trailer",{"$f":"IFERROR(VLOOKUP(C273,ELIST!$A$2:$E$300,2,FALSE),0)","v":0},{"$f":"IFERROR(VLOOKUP(C273,ELIST!$A$2:$E$300,5,FALSE),0)","v":0}]
["000000001002472095","Gen, Winching Equip Trlr","FL_PT","Trailer",{"$f":"IFERROR(VLOOKUP(C274,ELIST!$A$2:$E$300,2,FALSE),0)","v":0},{"$f":"IFERROR(VLOOKUP(C274,ELIST!$A$2:$E$300,5,FALSE),0)","v":0}]
["000000001002472096","Gen, Semi Trailer","FL_PT","Trailer",{"$f":"IFERROR(VLOOKUP(C275,ELIST!$A$2:$E$300,2,FALSE),0)","v":0},{"$f":"IFERROR(VLOOKUP(C275,ELIST!$A$2:$E$300,5,FALSE),0)","v":0}]
["000000001002472097","Gen, Cable Winch","FL_PW","Cable Winch",{"$f":"IFERROR(VLOOKUP(C276,ELIST!$A$2:$E$300,2,FALSE),0)","v":0},{"$f":"IFERROR(VLOOKUP(C276,ELIST!$A$2:$E$300,5,FALSE),0)","v":0}]
["000000001002472098","Gen, Power Transformer","TX_PWRTX","Power Transformer",{"$f":"IFERROR(VLOOKUP(C277,ELIST!$A$2:$E$300,2,FALSE),0)","v":0},{"$f":"IFERROR(VLOOKUP(C277,ELIST!$A$2:$E$300,5,FALSE),0)","v":0}]
["000000001002472099","Gen, Specialised Plant","FL_PX","Specialised Plant",{"$f":"IFERROR(VLOOKUP(C278,ELIST!$A$2:$E$300,2,FALSE),0)","v":0},{"$f":"IFERROR(VLOOKUP(C278,ELIST!$A$2:$E$300,5,FALSE),0)","v":0}]
["000000001002472100","Gen, Prsnnl Lft Equp Trlr","FL_PX","Specialised Plant",{"$f":"IFERROR(VLOOKUP(C279,ELIST!$A$2:$E$300,2,FALSE),0)","v":0},{"$f":"IFERROR(VLOOKUP(C279,ELIST!$A$2:$E$300,5,FALSE),0)","v":0}]
["000000001002472101","Gen, Rackable Magnetic VT","VT_RACKVT","Rackable Magnetic VT",{"$f":"IFERROR(VLOOKUP(C280,ELIST!$A$2:$E$300,2,FALSE),0)","v":0},{"$f":"IFERROR(VLOOKUP(C280,ELIST!$A$2:$E$300,5,FALSE),0)","v":0}]
["000000001002472102","Rackable Magnetic VT Oil Outdoor","VT_RACKVT","Rackable Magnetic VT",{"$f":"IFERROR(VLOOKUP(C281,ELIST!$A$2:$E$300,2,FALSE),0)","v":0},{"$f":"IFERROR(VLOOKUP(C281,ELIST!$A$2:$E$300,5,FALSE),0)","v":0}]
["000000001002472103","Rackable Magnetic VT Oil Indoor","VT_RACKVT","Rackable Magnetic VT",{"$f":"IFERROR(VLOOKUP(C282,ELIST!$A$2:$E$300,2,FALSE),0)","v":0},{"$f":"IFERROR(VLOOKUP(C282,ELIST!$A$2:$E$300,5,FALSE),0)","v":0}]
["000000001002472104","Rackable Magnetic VT SF6 Outdoor","VT_RACKVT","Rackable Magnetic VT",{"$f":"IFERROR(VLOOKUP(C283,ELIST!$A$2:$E$300,2,FALSE),0)","v":0},{"$f":"IFERROR(VLOOKUP(C283,ELIST!$A$2:$E$300,5,FALSE),0)","v":0}]
["000000001002472105","Rackable Magnetic VT SF6 Indoor","VT_RACKVT","Rackable Magnetic VT",{"$f":"IFERROR(VLOOKUP(C284,ELIST!$A$2:$E$300,2,FALSE),0)","v":0},{"$f":"IFERROR(VLOOKUP(C284,ELIST!$A$2:$E$300,5,FALSE),0)","v":0}]
["000000001002472106","Rackable Magnetic VT Epoxy Outdoor","VT_RACKVT","Rackable Magnetic VT",{"$f":"IFERROR(VLOOKUP(C285,ELIST!$A$2:$E$300,2,FALSE),0)","v":0},{"$f":"IFERROR(VLOOKUP(C285,ELIST!$A$2:$E$300,5,FALSE),0)","v":0}]
["000000001002472107","Rackable Magnetic VT Epoxy Indoor","VT_RACKVT","Rackable Magnetic VT",{"$f":"IFERROR(VLOOKUP(C286,ELIST!$A$2:$E$300,2,FALSE),0)","v":0},{"$f":"IFERROR(VLOOKUP(C286,ELIST!$A$2:$E$300,5,FALSE),0)","v":0}]
["000000001002472108","Rackable Magnetic VT GIS Outdoor","VT_RACKVT","Rackable Magnetic VT",{"$f":"IFERROR(VLOOKUP(C287,ELIST!$A$2:$E$300,2,FALSE),0)","v":0},{"$f":"IFERROR(VLOOKUP(C287,ELIST!$A$2:$E$300,5,FALSE),0)","v":0}]
["000000001002472109","Rackable Magnetic VT GIS Indoor","VT_RACKVT","Rackable Magnetic VT",{"$f":"IFERROR(VLOOKUP(C288,ELIST!$A$2:$E$300,2,FALSE),0)","v":0},{"$f":"IFERROR(VLOOKUP(C288,ELIST!$A$2:$E$300,5,FALSE),0)","v":0}]
["000000001002472110","Gen, RCDs","CV_RCD","RCDs",{"$f":"IFERROR(VLOOKUP(C289,ELIST!$A$2:$E$300,2,FALSE),0)","v":0},{"$f":"IFERROR(VLOOKUP(C289,ELIST!$A$2:$E$300,5,FALSE),0)","v":0}]
["000000001002472112","Gen, Recloser CB","CB_RECLCB","Recloser CB",{"$f":"IFERROR(VLOOKUP(C290,ELIST!$A$2:$E$300,2,FALSE),0)","v":0},{"$f":"IFERROR(VLOOKUP(C290,ELIST!$A$2:$E$300,5,FALSE),0)","v":0}]
["000000001002472113","Gen, Roof Access System","CV_RFACSY","Roof Access System",{"$f":"IFERROR(VLOOKUP(C291,ELIST!$A$2:$E$300,2,FALSE),0)","v":0},{"$f":"IFERROR(VLOOKUP(C291,ELIST!$A$2:$E$300,5,FALSE),0)","v":0}]
["000000001002472114","Gen, Security System","SS_SECSYS","Security System",{"$f":"IFERROR(VLOOKUP(C292,ELIST!$A$2:$E$300,2,FALSE),0)","v":0},{"$f":"IFERROR(VLOOKUP(C292,ELIST!$A$2:$E$300,5,FALSE),0)","v":0}]
["000000001002472115","Gen, Router","HW_ROUTR","Router",{"$f":"IFERROR(VLOOKUP(C293,ELIST!$A$2:$E$300,2,FALSE),0)","v":0},{"$f":"IFERROR(VLOOKUP(C293,ELIST!$A$2:$E$300,5,FALSE),0)","v":0}]
["000000001002472116","Gen, Remote Terminal Unit","SC_DISRTU","Distributed RTU",{"$f":"IFERROR(VLOOKUP(C294,ELIST!$A$2:$E$300,2,FALSE),0)","v":0},{"$f":"IFERROR(VLOOKUP(C294,ELIST!$A$2:$E$300,5,FALSE),0)","v":0}]
["000000001002472117","Gen, Safe","SS_SAFE","Safe",{"$f":"IFERROR(VLOOKUP(C295,ELIST!$A$2:$E$300,2,FALSE),0)","v":0},{"$f":"IFERROR(VLOOKUP(C295,ELIST!$A$2:$E$300,5,FALSE),0)","v":0}]
["000000001002472118","Gen, Scada Comms Equip","HW_SCADA","Scada Comms Equip",{"$f":"IFERROR(VLOOKUP(C296,ELIST!$A$2:$E$300,2,FALSE),0)","v":0},{"$f":"IFERROR(VLOOKUP(C296,ELIST!$A$2:$E$300,5,FALSE),0)","v":0}]
["000000001002472119","Gen, Scale","SA_SCALE","Scale",{"$f":"IFERROR(VLOOKUP(C297,ELIST!$A$2:$E$300,2,FALSE),0)","v":0},{"$f":"IFERROR(VLOOKUP(C297,ELIST!$A$2:$E$300,5,FALSE),0)","v":0}]
["000000001002472120","Gen, Security Device","SC_SCTYDV","Security Device",{"$f":"IFERROR(VLOOKUP(C298,ELIST!$A$2:$E$300,2,FALSE),0)","v":0},{"$f":"IFERROR(VLOOKUP(C298,ELIST!$A$2:$E$300,5,FALSE),0)","v":0}]
["000000001002472121","Gen, Storage Device","HW_SDEVIC","Storage Device",{"$f":"IFERROR(VLOOKUP(C299,ELIST!$A$2:$E$300,2,FALSE),0)","v":0},{"$f":"IFERROR(VLOOKUP(C299,ELIST!$A$2:$E$300,5,FALSE),0)","v":0}]
["000000001002472123","Gen, Septic Tank","CV_SEPTNK","Septic Tank",{"$f":"IFERROR(VLOOKUP(C300,ELIST!$A$2:$E$300,2,FALSE),0)","v":0},{"$f":"IFERROR(VLOOKUP(C300,ELIST!$A$2:$E$300,5,FALSE),0)","v":0}]
["000000001002472124","Gen, Server","HW_SERVER","Hardware Server",{"$f":"IFERROR(VLOOKUP(C301,ELIST!$A$2:$E$300,2,FALSE),0)","v":0},{"$f":"IFERROR(VLOOKUP(C301,ELIST!$A$2:$E$300,5,FALSE),0)","v":0}]
["000000001002472125","Gen, Static Freq Unit","AF_SFU","Static Freq Unit",{"$f":"IFERROR(VLOOKUP(C302,ELIST!$A$2:$E$300,2,FALSE),0)","v":0},{"$f":"IFERROR(VLOOKUP(C302,ELIST!$A$2:$E$300,5,FALSE),0)","v":0}]
["000000001002472126","Static Freq Unit 750 Hz","AF_SFU","Static Freq Unit",{"$f":"IFERROR(VLOOKUP(C303,ELIST!$A$2:$E$300,2,FALSE),0)","v":0},{"$f":"IFERROR(VLOOKUP(C303,ELIST!$A$2:$E$300,5,FALSE),0)","v":0}]
["000000001002472127","Static Freq Unit 1050 Hz","AF_SFU","Static Freq Unit",{"$f":"IFERROR(VLOOKUP(C304,ELIST!$A$2:$E$300,2,FALSE),0)","v":0},{"$f":"IFERROR(VLOOKUP(C304,ELIST!$A$2:$E$300,5,FALSE),0)","v":0}]
["000000001002472128","Gen, Roller Shutter Doors","BF_SHUTTR","Roller Shutter Doors",{"$f":"IFERROR(VLOOKUP(C305,ELIST!$A$2:$E$300,2,FALSE),0)","v":0},{"$f":"IFERROR(VLOOKUP(C305,ELIST!$A$2:$E$300,5,FALSE),0)","v":0}]
["000000001002472129","Gen, Salamander","CE_SLMNDR","Salamander",{"$f":"IFERROR(VLOOKUP(C306,ELIST!$A$2:$E$300,2,FALSE),0)","v":0},{"$f":"IFERROR(VLOOKUP(C306,ELIST!$A$2:$E$300,5,FALSE),0)","v":0}]
["000000001002472130","Gen, Smoke Hutch","FE_SMHTCH","Smoke Hutch",{"$f":"IFERROR(VLOOKUP(C307,ELIST!$A$2:$E$300,2,FALSE),0)","v":0},{"$f":"IFERROR(VLOOKUP(C307,ELIST!$A$2:$E$300,5,FALSE),0)","v":0}]
["000000001002472131","Gen, Software","SO_SOFTWR","Software",{"$f":"IFERROR(VLOOKUP(C308,ELIST!$A$2:$E$300,2,FALSE),0)","v":0},{"$f":"IFERROR(VLOOKUP(C308,ELIST!$A$2:$E$300,5,FALSE),0)","v":0}]
["000000001002472132","Gen, Spill Kit","CV_SPLKIT","Spill Kit",{"$f":"IFERROR(VLOOKUP(C309,ELIST!$A$2:$E$300,2,FALSE),0)","v":0},{"$f":"IFERROR(VLOOKUP(C309,ELIST!$A$2:$E$300,5,FALSE),0)","v":0}]
["000000001002472133","Gen, HVAC Split System","HC_SPLSYS","HVAC Split System",{"$f":"IFERROR(VLOOKUP(C310,ELIST!$A$2:$E$300,2,FALSE),0)","v":0},{"$f":"IFERROR(VLOOKUP(C310,ELIST!$A$2:$E$300,5,FALSE),0)","v":0}]
["000000001002472134","Gen, Sprinkler Valve Sys","FE_SPRKLV","Sprinkler Valve Sys",{"$f":"IFERROR(VLOOKUP(C311,ELIST!$A$2:$E$300,2,FALSE),0)","v":0},{"$f":"IFERROR(VLOOKUP(C311,ELIST!$A$2:$E$300,5,FALSE),0)","v":0}]
["000000001002472139","Gen, Static Line","HS_STATLN","Static Line",{"$f":"IFERROR(VLOOKUP(C312,ELIST!$A$2:$E$300,2,FALSE),0)","v":0},{"$f":"IFERROR(VLOOKUP(C312,ELIST!$A$2:$E$300,5,FALSE),0)","v":0}]
["000000001002472140","Gen, Steel Cubicle","CV_STLCUB","Steel Cubicle",{"$f":"IFERROR(VLOOKUP(C313,ELIST!$A$2:$E$300,2,FALSE),0)","v":0},{"$f":"IFERROR(VLOOKUP(C313,ELIST!$A$2:$E$300,5,FALSE),0)","v":0}]
["000000001002472146","Gen, Stove","CE_STOVE","Stove",{"$f":"IFERROR(VLOOKUP(C314,ELIST!$A$2:$E$300,2,FALSE),0)","v":0},{"$f":"IFERROR(VLOOKUP(C314,ELIST!$A$2:$E$300,5,FALSE),0)","v":0}]
["000000001002472147","Gen, Storage Tank","CV_STRTNK","Storage Tank",{"$f":"IFERROR(VLOOKUP(C315,ELIST!$A$2:$E$300,2,FALSE),0)","v":0},{"$f":"IFERROR(VLOOKUP(C315,ELIST!$A$2:$E$300,5,FALSE),0)","v":0}]
["000000001002472151","Gen, DSUB Monitor","DM_SUBMON","DSUB Monitor",{"$f":"IFERROR(VLOOKUP(C316,ELIST!$A$2:$E$300,2,FALSE),0)","v":0},{"$f":"IFERROR(VLOOKUP(C316,ELIST!$A$2:$E$300,5,FALSE),0)","v":0}]
["000000001002472152","Gen, Trans Surge Arrestor","TE_SURGE","Trans Surge Arrestor",{"$f":"IFERROR(VLOOKUP(C317,ELIST!$A$2:$E$300,2,FALSE),0)","v":0},{"$f":"IFERROR(VLOOKUP(C317,ELIST!$A$2:$E$300,5,FALSE),0)","v":0}]
["000000001002472153","Gen, Server Rack","HW_SVRRCK","Server Rack",{"$f":"IFERROR(VLOOKUP(C318,ELIST!$A$2:$E$300,2,FALSE),0)","v":0},{"$f":"IFERROR(VLOOKUP(C318,ELIST!$A$2:$E$300,5,FALSE),0)","v":0}]
["000000001002472154","Gen, Supervision Unit","AF_SVU","Supervision Unit",{"$f":"IFERROR(VLOOKUP(C319,ELIST!$A$2:$E$300,2,FALSE),0)","v":0},{"$f":"IFERROR(VLOOKUP(C319,ELIST!$A$2:$E$300,5,FALSE),0)","v":0}]
["000000001002472158","Gen, HV Switch/Fuse Unit","DG_SWFUNT","HV Switch/Fuse Unit",{"$f":"IFERROR(VLOOKUP(C320,ELIST!$A$2:$E$300,2,FALSE),0)","v":0},{"$f":"IFERROR(VLOOKUP(C320,ELIST!$A$2:$E$300,5,FALSE),0)","v":0}]
["000000001002472159","HV Swith/Fuse Unit- Epoxy Enc","DG_SWFUNT","HV Switch/Fuse Unit",{"$f":"IFERROR(VLOOKUP(C321,ELIST!$A$2:$E$300,2,FALSE),0)","v":0},{"$f":"IFERROR(VLOOKUP(C321,ELIST!$A$2:$E$300,5,FALSE),0)","v":0}]
["000000001002472160","HV Switch/Fuse Unit - Steel Enc","DG_SWFUNT","HV Switch/Fuse Unit",{"$f":"IFERROR(VLOOKUP(C322,ELIST!$A$2:$E$300,2,FALSE),0)","v":0},{"$f":"IFERROR(VLOOKUP(C322,ELIST!$A$2:$E$300,5,FALSE),0)","v":0}]
["000000001002472161","Gen, Network Switch","HW_SWITCH","Network Switch",{"$f":"IFERROR(VLOOKUP(C323,ELIST!$A$2:$E$300,2,FALSE),0)","v":0},{"$f":"IFERROR(VLOOKUP(C323,ELIST!$A$2:$E$300,5,FALSE),0)","v":0}]
["000000001002472165","Gen, HV Switch Unit","DG_SWUNT","HV Switch Unit",{"$f":"IFERROR(VLOOKUP(C324,ELIST!$A$2:$E$300,2,FALSE),0)","v":0},{"$f":"IFERROR(VLOOKUP(C324,ELIST!$A$2:$E$300,5,FALSE),0)","v":0}]
["000000001002472166","HV Switch Unit - Epoxy Encapsulated","DG_SWUNT","HV Switch Unit",{"$f":"IFERROR(VLOOKUP(C325,ELIST!$A$2:$E$300,2,FALSE),0)","v":0},{"$f":"IFERROR(VLOOKUP(C325,ELIST!$A$2:$E$300,5,FALSE),0)","v":0}]
["000000001002472167","HV Switch Unit - Steel Enc","DG_SWUNT","HV Switch Unit",{"$f":"IFERROR(VLOOKUP(C326,ELIST!$A$2:$E$300,2,FALSE),0)","v":0},{"$f":"IFERROR(VLOOKUP(C326,ELIST!$A$2:$E$300,5,FALSE),0)","v":0}]
["000000001002472168","Gen, Switch Yard","CV_SWYD","Switch Yard",{"$f":"IFERROR(VLOOKUP(C327,ELIST!$A$2:$E$300,2,FALSE),0)","v":0},{"$f":"IFERROR(VLOOKUP(C327,ELIST!$A$2:$E$300,5,FALSE),0)","v":0}]
["000000001002472169","Gen, PC Tablet","HW_TABLET","PC Tablet",{"$f":"IFERROR(VLOOKUP(C328,ELIST!$A$2:$E$300,2,FALSE),0)","v":0},{"$f":"IFERROR(VLOOKUP(C328,ELIST!$A$2:$E$300,5,FALSE),0)","v":0}]
["000000001002472170","Gen, Tapchanger","TC_TAPCHG","Tapchanger",{"$f":"IFERROR(VLOOKUP(C329,ELIST!$A$2:$E$300,2,FALSE),0)","v":0},{"$f":"IFERROR(VLOOKUP(C329,ELIST!$A$2:$E$300,5,FALSE),0)","v":0}]
["000000001002472171","Tapchanger 33kV Reinhausen","TC_TAPCHG","Tapchanger",{"$f":"IFERROR(VLOOKUP(C330,ELIST!$A$2:$E$300,2,FALSE),0)","v":0},{"$f":"IFERROR(VLOOKUP(C330,ELIST!$A$2:$E$300,5,FALSE),0)","v":0}]
["000000001002472172","Tapchanger 66kV Reinhausen","TC_TAPCHG","Tapchanger",{"$f":"IFERROR(VLOOKUP(C331,ELIST!$A$2:$E$300,2,FALSE),0)","v":0},{"$f":"IFERROR(VLOOKUP(C331,ELIST!$A$2:$E$300,5,FALSE),0)","v":0}]
["000000001002472173","Tapchanger 132kV Reinhausen","TC_TAPCHG","Tapchanger",{"$f":"IFERROR(VLOOKUP(C332,ELIST!$A$2:$E$300,2,FALSE),0)","v":0},{"$f":"IFERROR(VLOOKUP(C332,ELIST!$A$2:$E$300,5,FALSE),0)","v":0}]
["000000001002472174","Tapchanger 33kV Other","TC_TAPCHG","Tapchanger",{"$f":"IFERROR(VLOOKUP(C333,ELIST!$A$2:$E$300,2,FALSE),0)","v":0},{"$f":"IFERROR(VLOOKUP(C333,ELIST!$A$2:$E$300,5,FALSE),0)","v":0}]
["000000001002472175","Tapchanger 66kV Other","TC_TAPCHG","Tapchanger",{"$f":"IFERROR(VLOOKUP(C334,ELIST!$A$2:$E$300,2,FALSE),0)","v":0},{"$f":"IFERROR(VLOOKUP(C334,ELIST!$A$2:$E$300,5,FALSE),0)","v":0}]
["000000001002472176","Tapchanger 132kV Other","TC_TAPCHG","Tapchanger",{"$f":"IFERROR(VLOOKUP(C335,ELIST!$A$2:$E$300,2,FALSE),0)","v":0},{"$f":"IFERROR(VLOOKUP(C335,ELIST!$A$2:$E$300,5,FALSE),0)","v":0}]
["000000001002472177","Gen, Tool Battery Powered","TO_TBATT","Tool Battery Powered",{"$f":"IFERROR(VLOOKUP(C336,ELIST!$A$2:$E$300,2,FALSE),0)","v":0},{"$f":"IFERROR(VLOOKUP(C336,ELIST!$A$2:$E$300,5,FALSE),0)","v":0}]
["000000001002472178","Gen, Telephonics","HW_TELEPH","Telephonics",{"$f":"IFERROR(VLOOKUP(C337,ELIST!$A$2:$E$300,2,FALSE),0)","v":0},{"$f":"IFERROR(VLOOKUP(C337,ELIST!$A$2:$E$300,5,FALSE),0)","v":0}]
["000000001002472179","Gen, Fuel Tank","CH_TNKFUL","Fuel Tank",{"$f":"IFERROR(VLOOKUP(C338,ELIST!$A$2:$E$300,2,FALSE),0)","v":0},{"$f":"IFERROR(VLOOKUP(C338,ELIST!$A$2:$E$300,5,FALSE),0)","v":0}]
["000000001002472180","Gen, Toilet","CV_TOILET","Toilet",{"$f":"IFERROR(VLOOKUP(C339,ELIST!$A$2:$E$300,2,FALSE),0)","v":0},{"$f":"IFERROR(VLOOKUP(C339,ELIST!$A$2:$E$300,5,FALSE),0)","v":0}]
["000000001002472181","Gen, Tower","TW_TOWER","Tower",{"$f":"IFERROR(VLOOKUP(C340,ELIST!$A$2:$E$300,2,FALSE),0)","v":0},{"$f":"IFERROR(VLOOKUP(C340,ELIST!$A$2:$E$300,5,FALSE),0)","v":0}]
["000000001002472182","Gen, Truck Cable","FL_TR","Truck",{"$f":"IFERROR(VLOOKUP(C341,ELIST!$A$2:$E$300,2,FALSE),0)","v":0},{"$f":"IFERROR(VLOOKUP(C341,ELIST!$A$2:$E$300,5,FALSE),0)","v":0}]
["000000001002472183","Truck Flat Bed Large","FL_TR","Truck",{"$f":"IFERROR(VLOOKUP(C342,ELIST!$A$2:$E$300,2,FALSE),0)","v":0},{"$f":"IFERROR(VLOOKUP(C342,ELIST!$A$2:$E$300,5,FALSE),0)","v":0}]
["000000001002472184","Truck Flat Bed Med","FL_TR","Truck",{"$f":"IFERROR(VLOOKUP(C343,ELIST!$A$2:$E$300,2,FALSE),0)","v":0},{"$f":"IFERROR(VLOOKUP(C343,ELIST!$A$2:$E$300,5,FALSE),0)","v":0}]
["000000001002472185","Truck Generator","FL_TR","Truck",{"$f":"IFERROR(VLOOKUP(C344,ELIST!$A$2:$E$300,2,FALSE),0)","v":0},{"$f":"IFERROR(VLOOKUP(C344,ELIST!$A$2:$E$300,5,FALSE),0)","v":0}]
["000000001002472186","Truck Pole Delivery","FL_TR","Truck",{"$f":"IFERROR(VLOOKUP(C345,ELIST!$A$2:$E$300,2,FALSE),0)","v":0},{"$f":"IFERROR(VLOOKUP(C345,ELIST!$A$2:$E$300,5,FALSE),0)","v":0}]
["000000001002472187","Truck Subs Tech","FL_TR","Truck",{"$f":"IFERROR(VLOOKUP(C346,ELIST!$A$2:$E$300,2,FALSE),0)","v":0},{"$f":"IFERROR(VLOOKUP(C346,ELIST!$A$2:$E$300,5,FALSE),0)","v":0}]
["000000001002472188","Truck Large Service","FL_TR","Truck",{"$f":"IFERROR(VLOOKUP(C347,ELIST!$A$2:$E$300,2,FALSE),0)","v":0},{"$f":"IFERROR(VLOOKUP(C347,ELIST!$A$2:$E$300,5,FALSE),0)","v":0}]
["000000001002472189","Truck Small Service","FL_TR","Truck",{"$f":"IFERROR(VLOOKUP(C348,ELIST!$A$2:$E$300,2,FALSE),0)","v":0},{"$f":"IFERROR(VLOOKUP(C348,ELIST!$A$2:$E$300,5,FALSE),0)","v":0}]
["000000001002472190","Truck Large Tipper","FL_TR","Truck",{"$f":"IFERROR(VLOOKUP(C349,ELIST!$A$2:$E$300,2,FALSE),0)","v":0},{"$f":"IFERROR(VLOOKUP(C349,ELIST!$A$2:$E$300,5,FALSE),0)","v":0}]
["000000001002472191","Truck Medium Tipper","FL_TR","Truck",{"$f":"IFERROR(VLOOKUP(C350,ELIST!$A$2:$E$300,2,FALSE),0)","v":0},{"$f":"IFERROR(VLOOKUP(C350,ELIST!$A$2:$E$300,5,FALSE),0)","v":0}]
["000000001002472192","Truck Small Tipper","FL_TR","Truck",{"$f":"IFERROR(VLOOKUP(C351,ELIST!$A$2:$E$300,2,FALSE),0)","v":0},{"$f":"IFERROR(VLOOKUP(C351,ELIST!$A$2:$E$300,5,FALSE),0)","v":0}]
["000000001002472196","Gen, Trench","CV_TRNH","Trench",{"$f":"IFERROR(VLOOKUP(C352,ELIST!$A$2:$E$300,2,FALSE),0)","v":0},{"$f":"IFERROR(VLOOKUP(C352,ELIST!$A$2:$E$300,5,FALSE),0)","v":0}]
["000000001002472197","Gen, Trench Cover","CV_TRNHCO","Trench Cover",{"$f":"IFERROR(VLOOKUP(C353,ELIST!$A$2:$E$300,2,FALSE),0)","v":0},{"$f":"IFERROR(VLOOKUP(C353,ELIST!$A$2:$E$300,5,FALSE),0)","v":0}]
["000000001002472198","Gen, CB Truck","CB_TRUKCB","CB Truck",{"$f":"IFERROR(VLOOKUP(C354,ELIST!$A$2:$E$300,2,FALSE),0)","v":0},{"$f":"IFERROR(VLOOKUP(C354,ELIST!$A$2:$E$300,5,FALSE),0)","v":0}]
["000000001002472199","CB Truck Bulk Oil","CB_TRUKCB","CB Truck",{"$f":"IFERROR(VLOOKUP(C355,ELIST!$A$2:$E$300,2,FALSE),0)","v":0},{"$f":"IFERROR(VLOOKUP(C355,ELIST!$A$2:$E$300,5,FALSE),0)","v":0}]
["000000001002472200","CB Truck Small Oil","CB_TRUKCB","CB Truck",{"$f":"IFERROR(VLOOKUP(C356,ELIST!$A$2:$E$300,2,FALSE),0)","v":0},{"$f":"IFERROR(VLOOKUP(C356,ELIST!$A$2:$E$300,5,FALSE),0)","v":0}]
["000000001002472201","Gen, SF6 Circuit Breaker","CB_TRUKCB","CB Truck",{"$f":"IFERROR(VLOOKUP(C357,ELIST!$A$2:$E$300,2,FALSE),0)","v":0},{"$f":"IFERROR(VLOOKUP(C357,ELIST!$A$2:$E$300,5,FALSE),0)","v":0}]
["000000001002472202","Gen, Vacuum Circuit Breaker","CB_TRUKCB","CB Truck",{"$f":"IFERROR(VLOOKUP(C358,ELIST!$A$2:$E$300,2,FALSE),0)","v":0},{"$f":"IFERROR(VLOOKUP(C358,ELIST!$A$2:$E$300,5,FALSE),0)","v":0}]
["000000001002472203","Gen, Bulk Oil CB","CB_TRUKCB","CB Truck",{"$f":"IFERROR(VLOOKUP(C359,ELIST!$A$2:$E$300,2,FALSE),0)","v":0},{"$f":"IFERROR(VLOOKUP(C359,ELIST!$A$2:$E$300,5,FALSE),0)","v":0}]
["000000001002472204","Gen, Small Oil CB","CB_TRUKCB","CB Truck",{"$f":"IFERROR(VLOOKUP(C360,ELIST!$A$2:$E$300,2,FALSE),0)","v":0},{"$f":"IFERROR(VLOOKUP(C360,ELIST!$A$2:$E$300,5,FALSE),0)","v":0}]
["000000001002472205","Gen, Pit Trans/Zone Sub","CV_TSPIT","Pit Trans/Zone Sub",{"$f":"IFERROR(VLOOKUP(C361,ELIST!$A$2:$E$300,2,FALSE),0)","v":0},{"$f":"IFERROR(VLOOKUP(C361,ELIST!$A$2:$E$300,5,FALSE),0)","v":0}]
["000000001002472206","Gen, TSUB Radio","CM_TSRAD","TSUB Radio",{"$f":"IFERROR(VLOOKUP(C362,ELIST!$A$2:$E$300,2,FALSE),0)","v":0},{"$f":"IFERROR(VLOOKUP(C362,ELIST!$A$2:$E$300,5,FALSE),0)","v":0}]
["000000001002472207","Gen, Tower Radio","CM_TWRAD","Tower Radio",{"$f":"IFERROR(VLOOKUP(C363,ELIST!$A$2:$E$300,2,FALSE),0)","v":0},{"$f":"IFERROR(VLOOKUP(C363,ELIST!$A$2:$E$300,5,FALSE),0)","v":0}]
["000000001002472208","Gen, Trf Auxiliary Relay","PR_TXAXPR","Trf Auxiliary Relay",{"$f":"IFERROR(VLOOKUP(C364,ELIST!$A$2:$E$300,2,FALSE),0)","v":0},{"$f":"IFERROR(VLOOKUP(C364,ELIST!$A$2:$E$300,5,FALSE),0)","v":0}]
["000000001002472209","Gen, Trf Diff Relay","PR_TXDFPR","Trf Diff Relay",{"$f":"IFERROR(VLOOKUP(C365,ELIST!$A$2:$E$300,2,FALSE),0)","v":0},{"$f":"IFERROR(VLOOKUP(C365,ELIST!$A$2:$E$300,5,FALSE),0)","v":0}]
["000000001002472210","Gen, Underfrequency Relay","PR_UFPR","Underfrequency Relay",{"$f":"IFERROR(VLOOKUP(C366,ELIST!$A$2:$E$300,2,FALSE),0)","v":0},{"$f":"IFERROR(VLOOKUP(C366,ELIST!$A$2:$E$300,5,FALSE),0)","v":0}]
["000000001002472211","Gen, UG Consumer Mains","FD_UGCONM","UG Consumer Mains",{"$f":"IFERROR(VLOOKUP(C367,ELIST!$A$2:$E$300,2,FALSE),0)","v":0},{"$f":"IFERROR(VLOOKUP(C367,ELIST!$A$2:$E$300,5,FALSE),0)","v":0}]
["000000001002472213","Gen, UG Cable Segment","TE_UGSEG","UG Cable Segment",{"$f":"IFERROR(VLOOKUP(C368,ELIST!$A$2:$E$300,2,FALSE),0)","v":0},{"$f":"IFERROR(VLOOKUP(C368,ELIST!$A$2:$E$300,5,FALSE),0)","v":0}]
["000000001002472219","Gen, UHF Base","CM_UHFB","UHF Base",{"$f":"IFERROR(VLOOKUP(C369,ELIST!$A$2:$E$300,2,FALSE),0)","v":0},{"$f":"IFERROR(VLOOKUP(C369,ELIST!$A$2:$E$300,5,FALSE),0)","v":0}]
["000000001002472220","Gen, Uninterrupted Power Supply","HW_UPS","Unintrptd Pwr Spply",{"$f":"IFERROR(VLOOKUP(C370,ELIST!$A$2:$E$300,2,FALSE),0)","v":0},{"$f":"IFERROR(VLOOKUP(C370,ELIST!$A$2:$E$300,5,FALSE),0)","v":0}]
["000000001002472224","Gen, Vehicle Telematics","FL_VEHTEL","Vehicle Telematics",{"$f":"IFERROR(VLOOKUP(C371,ELIST!$A$2:$E$300,2,FALSE),0)","v":0},{"$f":"IFERROR(VLOOKUP(C371,ELIST!$A$2:$E$300,5,FALSE),0)","v":0}]
["000000001002472225","Gen, Vending Machine","CE_VENDMA","Vending Machine",{"$f":"IFERROR(VLOOKUP(C372,ELIST!$A$2:$E$300,2,FALSE),0)","v":0},{"$f":"IFERROR(VLOOKUP(C372,ELIST!$A$2:$E$300,5,FALSE),0)","v":0}]
["000000001002472226","Gen, VESDA","FE_VESDA","VESDA",{"$f":"IFERROR(VLOOKUP(C373,ELIST!$A$2:$E$300,2,FALSE),0)","v":0},{"$f":"IFERROR(VLOOKUP(C373,ELIST!$A$2:$E$300,5,FALSE),0)","v":0}]
["000000001002472227","Gen, Vhcle Accs Trk Gte","AT_VHACGT","Vhcle Accs Trk Gte",{"$f":"IFERROR(VLOOKUP(C374,ELIST!$A$2:$E$300,2,FALSE),0)","v":0},{"$f":"IFERROR(VLOOKUP(C374,ELIST!$A$2:$E$300,5,FALSE),0)","v":0}]
["000000001002472228","Gen, Vehicle Gate","CV_VHGATE","Vehicle Access Gate",{"$f":"IFERROR(VLOOKUP(C375,ELIST!$A$2:$E$300,2,FALSE),0)","v":0},{"$f":"IFERROR(VLOOKUP(C375,ELIST!$A$2:$E$300,5,FALSE),0)","v":0}]
["000000001002472229","Heavy Duty Gate","CV_VHGATE","Vehicle Access Gate",{"$f":"IFERROR(VLOOKUP(C376,ELIST!$A$2:$E$300,2,FALSE),0)","v":0},{"$f":"IFERROR(VLOOKUP(C376,ELIST!$A$2:$E$300,5,FALSE),0)","v":0}]
["000000001002472230","Standard Gate, Large","CV_VHGATE","Vehicle Access Gate",{"$f":"IFERROR(VLOOKUP(C377,ELIST!$A$2:$E$300,2,FALSE),0)","v":0},{"$f":"IFERROR(VLOOKUP(C377,ELIST!$A$2:$E$300,5,FALSE),0)","v":0}]
["000000001002472231","Standard Gate, Small","CV_VHGATE","Vehicle Access Gate",{"$f":"IFERROR(VLOOKUP(C378,ELIST!$A$2:$E$300,2,FALSE),0)","v":0},{"$f":"IFERROR(VLOOKUP(C378,ELIST!$A$2:$E$300,5,FALSE),0)","v":0}]
["000000001002472232","Gen, Acc Trk Water Cross","AT_VHWYCR","Acc Trk Water Cross",{"$f":"IFERROR(VLOOKUP(C379,ELIST!$A$2:$E$300,2,FALSE),0)","v":0},{"$f":"IFERROR(VLOOKUP(C379,ELIST!$A$2:$E$300,5,FALSE),0)","v":0}]
["000000001002472233","Bridge, Wooden","AT_VHWYCR","Acc Trk Water Cross",{"$f":"IFERROR(VLOOKUP(C380,ELIST!$A$2:$E$300,2,FALSE),0)","v":0},{"$f":"IFERROR(VLOOKUP(C380,ELIST!$A$2:$E$300,5,FALSE),0)","v":0}]
["000000001002472234","Bridge, Steel","AT_VHWYCR","Acc Trk Water Cross",{"$f":"IFERROR(VLOOKUP(C381,ELIST!$A$2:$E$300,2,FALSE),0)","v":0},{"$f":"IFERROR(VLOOKUP(C381,ELIST!$A$2:$E$300,5,FALSE),0)","v":0}]
["000000001002472235","Culvert","AT_VHWYCR","Acc Trk Water Cross",{"$f":"IFERROR(VLOOKUP(C382,ELIST!$A$2:$E$300,2,FALSE),0)","v":0},{"$f":"IFERROR(VLOOKUP(C382,ELIST!$A$2:$E$300,5,FALSE),0)","v":0}]
["000000001002472236","Causeway - Concrete","AT_VHWYCR","Acc Trk Water Cross",{"$f":"IFERROR(VLOOKUP(C383,ELIST!$A$2:$E$300,2,FALSE),0)","v":0},{"$f":"IFERROR(VLOOKUP(C383,ELIST!$A$2:$E$300,5,FALSE),0)","v":0}]
["000000001002472237","Ford (Crossing) - Natural","AT_VHWYCR","Acc Trk Water Cross",{"$f":"IFERROR(VLOOKUP(C384,ELIST!$A$2:$E$300,2,FALSE),0)","v":0},{"$f":"IFERROR(VLOOKUP(C384,ELIST!$A$2:$E$300,5,FALSE),0)","v":0}]
["000000001002472238","Gen, Voltage Prot Relay","PR_VOLTPR","Voltage Prot Relay",{"$f":"IFERROR(VLOOKUP(C385,ELIST!$A$2:$E$300,2,FALSE),0)","v":0},{"$f":"IFERROR(VLOOKUP(C385,ELIST!$A$2:$E$300,5,FALSE),0)","v":0}]
["000000001002472241","Gen, Moble Wireless Card","HW_WICARD","Moble Wireless Card",{"$f":"IFERROR(VLOOKUP(C386,ELIST!$A$2:$E$300,2,FALSE),0)","v":0},{"$f":"IFERROR(VLOOKUP(C386,ELIST!$A$2:$E$300,5,FALSE),0)","v":0}]
["000000001002472242","Gen, Wall Bushing","TE_WLBUSH","Wall Bushing",{"$f":"IFERROR(VLOOKUP(C387,ELIST!$A$2:$E$300,2,FALSE),0)","v":0},{"$f":"IFERROR(VLOOKUP(C387,ELIST!$A$2:$E$300,5,FALSE),0)","v":0}]
["000000001002472243","Wall Bushing Indoor","TE_WLBUSH","Wall Bushing",{"$f":"IFERROR(VLOOKUP(C388,ELIST!$A$2:$E$300,2,FALSE),0)","v":0},{"$f":"IFERROR(VLOOKUP(C388,ELIST!$A$2:$E$300,5,FALSE),0)","v":0}]
["000000001002472244","Wall Bushing Outdoor","TE_WLBUSH","Wall Bushing",{"$f":"IFERROR(VLOOKUP(C389,ELIST!$A$2:$E$300,2,FALSE),0)","v":0},{"$f":"IFERROR(VLOOKUP(C389,ELIST!$A$2:$E$300,5,FALSE),0)","v":0}]
["000000001002472247","Gen, Water Pump Set","CV_WPUMP","Water Pump Set",{"$f":"IFERROR(VLOOKUP(C390,ELIST!$A$2:$E$300,2,FALSE),0)","v":0},{"$f":"IFERROR(VLOOKUP(C390,ELIST!$A$2:$E$300,5,FALSE),0)","v":0}]
["000000001002472248","Gen, Water Storage Tank","CV_WSTTNK","Water Storage Tank",{"$f":"IFERROR(VLOOKUP(C391,ELIST!$A$2:$E$300,2,FALSE),0)","v":0},{"$f":"IFERROR(VLOOKUP(C391,ELIST!$A$2:$E$300,5,FALSE),0)","v":0}]
["000000001002472249","LV Link Box - Solid","SW_LVLKBX","LV Link Box",{"$f":"IFERROR(VLOOKUP(C392,ELIST!$A$2:$E$300,2,FALSE),0)","v":0},{"$f":"IFERROR(VLOOKUP(C392,ELIST!$A$2:$E$300,5,FALSE),0)","v":0}]
["000000001002472250","LV Link Box - Removeable Link","SW_LVLKBX","LV Link Box",{"$f":"IFERROR(VLOOKUP(C393,ELIST!$A$2:$E$300,2,FALSE),0)","v":0},{"$f":"IFERROR(VLOOKUP(C393,ELIST!$A$2:$E$300,5,FALSE),0)","v":0}]
["000000001002472251","LV Link Box - Fuse","SW_LVLKBX","LV Link Box",{"$f":"IFERROR(VLOOKUP(C394,ELIST!$A$2:$E$300,2,FALSE),0)","v":0},{"$f":"IFERROR(VLOOKUP(C394,ELIST!$A$2:$E$300,5,FALSE),0)","v":0}]
["000000001002472255","Gen, Automatic_Transfer_Switch_ATS","GN_AUTTSW","Auto Transfer Switch",{"$f":"IFERROR(VLOOKUP(C395,ELIST!$A$2:$E$300,2,FALSE),0)","v":0},{"$f":"IFERROR(VLOOKUP(C395,ELIST!$A$2:$E$300,5,FALSE),0)","v":0}]
["000000001002472256","Gen, Vehicle_Hoist","CN_VHOIST","Vehicle Hoist",{"$f":"IFERROR(VLOOKUP(C396,ELIST!$A$2:$E$300,2,FALSE),0)","v":0},{"$f":"IFERROR(VLOOKUP(C396,ELIST!$A$2:$E$300,5,FALSE),0)","v":0}]
["000000001002472257","Gen, Solar_PV_Panel","SB_SOLPNL","Solar Panels",{"$f":"IFERROR(VLOOKUP(C397,ELIST!$A$2:$E$300,2,FALSE),0)","v":0},{"$f":"IFERROR(VLOOKUP(C397,ELIST!$A$2:$E$300,5,FALSE),0)","v":0}]
["000000001002472258","Gen, Filter_Water_Treatment","CV_FILTWT","FilterWaterTreatment",{"$f":"IFERROR(VLOOKUP(C398,ELIST!$A$2:$E$300,2,FALSE),0)","v":0},{"$f":"IFERROR(VLOOKUP(C398,ELIST!$A$2:$E$300,5,FALSE),0)","v":0}]
["000000001002472259","Gen, Flow_Meter_Hydraulic","CV_FLOWMH","Flow Meter Hydraulic",{"$f":"IFERROR(VLOOKUP(C399,ELIST!$A$2:$E$300,2,FALSE),0)","v":0},{"$f":"IFERROR(VLOOKUP(C399,ELIST!$A$2:$E$300,5,FALSE),0)","v":0}]
["000000001002472260","Gen, Macerator","CV_MACER","Macerator",{"$f":"IFERROR(VLOOKUP(C400,ELIST!$A$2:$E$300,2,FALSE),0)","v":0},{"$f":"IFERROR(VLOOKUP(C400,ELIST!$A$2:$E$300,5,FALSE),0)","v":0}]
["000000001002472261","Gen, Truck Exhaust Extractor","CV_TEXHXT","Truck ExhstExtravtor",{"$f":"IFERROR(VLOOKUP(C401,ELIST!$A$2:$E$300,2,FALSE),0)","v":0},{"$f":"IFERROR(VLOOKUP(C401,ELIST!$A$2:$E$300,5,FALSE),0)","v":0}]
["000000001002472262","Gen, Thermostatic_Mixing_Valve_TMV","CV_THMIXV","ThermostMixing Valve",{"$f":"IFERROR(VLOOKUP(C402,ELIST!$A$2:$E$300,2,FALSE),0)","v":0},{"$f":"IFERROR(VLOOKUP(C402,ELIST!$A$2:$E$300,5,FALSE),0)","v":0}]
["000000001002472263","Gen, Pump control board","CV_PCTLBD","Pump Control Board",{"$f":"IFERROR(VLOOKUP(C403,ELIST!$A$2:$E$300,2,FALSE),0)","v":0},{"$f":"IFERROR(VLOOKUP(C403,ELIST!$A$2:$E$300,5,FALSE),0)","v":0}]
["000000001002472264","Gen, Switchboard_Mechanical","SB_MECHSB","Switchboard Mech",{"$f":"IFERROR(VLOOKUP(C404,ELIST!$A$2:$E$300,2,FALSE),0)","v":0},{"$f":"IFERROR(VLOOKUP(C404,ELIST!$A$2:$E$300,5,FALSE),0)","v":0}]
["000000001002472265","Gen, Switchboard_Distribution","SB_DISTSB","Switchboard Distrib",{"$f":"IFERROR(VLOOKUP(C405,ELIST!$A$2:$E$300,2,FALSE),0)","v":0},{"$f":"IFERROR(VLOOKUP(C405,ELIST!$A$2:$E$300,5,FALSE),0)","v":0}]
["000000001002472266","Gen, Variable_Refrigerant_Volume_Box_VRV","HC_VRV","VarRefrigVolBox VRV",{"$f":"IFERROR(VLOOKUP(C406,ELIST!$A$2:$E$300,2,FALSE),0)","v":0},{"$f":"IFERROR(VLOOKUP(C406,ELIST!$A$2:$E$300,5,FALSE),0)","v":0}]
["000000001002472267","Gen, Variable_Speed_Drive_VSD","HC_VSD","Var Speed Drive VSD",{"$f":"IFERROR(VLOOKUP(C407,ELIST!$A$2:$E$300,2,FALSE),0)","v":0},{"$f":"IFERROR(VLOOKUP(C407,ELIST!$A$2:$E$300,5,FALSE),0)","v":0}]
["000000001002472268","Gen, Variable_Air_Volume_Box_VAV","HC_VAV","VarAirVolume Box VAV",{"$f":"IFERROR(VLOOKUP(C408,ELIST!$A$2:$E$300,2,FALSE),0)","v":0},{"$f":"IFERROR(VLOOKUP(C408,ELIST!$A$2:$E$300,5,FALSE),0)","v":0}]
["000000001002472269","Gen, Fan_Outside_Air","HC_OAIRFN","Outside Air Fan",{"$f":"IFERROR(VLOOKUP(C409,ELIST!$A$2:$E$300,2,FALSE),0)","v":0},{"$f":"IFERROR(VLOOKUP(C409,ELIST!$A$2:$E$300,5,FALSE),0)","v":0}]
["000000001002472270","Gen, Fan_Supply_Air","HC_SAIRFN","Supply Air Fan",{"$f":"IFERROR(VLOOKUP(C410,ELIST!$A$2:$E$300,2,FALSE),0)","v":0},{"$f":"IFERROR(VLOOKUP(C410,ELIST!$A$2:$E$300,5,FALSE),0)","v":0}]
["000000001002472271","Gen, Static_Transfer_Switch_STS","GN_STS","StaticTransSwitchSTS",{"$f":"IFERROR(VLOOKUP(C411,ELIST!$A$2:$E$300,2,FALSE),0)","v":0},{"$f":"IFERROR(VLOOKUP(C411,ELIST!$A$2:$E$300,5,FALSE),0)","v":0}]
["000000001002472272","Gen, Load_Bank","GN_LDBANK","Load Bank",{"$f":"IFERROR(VLOOKUP(C412,ELIST!$A$2:$E$300,2,FALSE),0)","v":0},{"$f":"IFERROR(VLOOKUP(C412,ELIST!$A$2:$E$300,5,FALSE),0)","v":0}]
["000000001002472273","Gen, Surge_Protection_Device","SB_SURGDV","Surge Protect Device",{"$f":"IFERROR(VLOOKUP(C413,ELIST!$A$2:$E$300,2,FALSE),0)","v":0},{"$f":"IFERROR(VLOOKUP(C413,ELIST!$A$2:$E$300,5,FALSE),0)","v":0}]
["000000001002472274","Gen, Pump_Fuel_Chemical_Delivery","CH_FULPMP","Fuel Pump",{"$f":"IFERROR(VLOOKUP(C414,ELIST!$A$2:$E$300,2,FALSE),0)","v":0},{"$f":"IFERROR(VLOOKUP(C414,ELIST!$A$2:$E$300,5,FALSE),0)","v":0}]
["000000001002472275","Gen, Filter_Fuel_Chemical_Delivery","CH_FILTER","Fuel Filter",{"$f":"IFERROR(VLOOKUP(C415,ELIST!$A$2:$E$300,2,FALSE),0)","v":0},{"$f":"IFERROR(VLOOKUP(C415,ELIST!$A$2:$E$300,5,FALSE),0)","v":0}]
["000000001002472276","Gen, Fuel_Leak_Detector","CH_LEAKDT","Fuel Leak Detector",{"$f":"IFERROR(VLOOKUP(C416,ELIST!$A$2:$E$300,2,FALSE),0)","v":0},{"$f":"IFERROR(VLOOKUP(C416,ELIST!$A$2:$E$300,5,FALSE),0)","v":0}]
["000000001002472277","Gen, Onsite Stormwater Retention OSD","CV_STWRET","Stormwater Retention",{"$f":"IFERROR(VLOOKUP(C417,ELIST!$A$2:$E$300,2,FALSE),0)","v":0},{"$f":"IFERROR(VLOOKUP(C417,ELIST!$A$2:$E$300,5,FALSE),0)","v":0}]
["000000001002472278","Gen, Drying Cabinet","TO_DRYCAB","Drying Cabinet",{"$f":"IFERROR(VLOOKUP(C418,ELIST!$A$2:$E$300,2,FALSE),0)","v":0},{"$f":"IFERROR(VLOOKUP(C418,ELIST!$A$2:$E$300,5,FALSE),0)","v":0}]
["000000001002472279","Gen, Refrigerator Unit Commercial","CE_FRIDGE","RefrigUnitCommercial",{"$f":"IFERROR(VLOOKUP(C419,ELIST!$A$2:$E$300,2,FALSE),0)","v":0},{"$f":"IFERROR(VLOOKUP(C419,ELIST!$A$2:$E$300,5,FALSE),0)","v":0}]
["000000001002472280","Gen, Valve_Hydraulic_Delivery","CV_VALVE","Valve",{"$f":"IFERROR(VLOOKUP(C420,ELIST!$A$2:$E$300,2,FALSE),0)","v":0},{"$f":"IFERROR(VLOOKUP(C420,ELIST!$A$2:$E$300,5,FALSE),0)","v":0}]
["000000001002472281","Gen, Uninterruptible Power Supply UPS","UP_UPS","Unintrptd PwrSup Lrg",{"$f":"IFERROR(VLOOKUP(C421,ELIST!$A$2:$E$300,2,FALSE),0)","v":0},{"$f":"IFERROR(VLOOKUP(C421,ELIST!$A$2:$E$300,5,FALSE),0)","v":0}]
["000000001002472282","Gen, Chemical Dosing Assembly","HC_PUMPST","Chemical Dosing Faci",{"$f":"IFERROR(VLOOKUP(C422,ELIST!$A$2:$E$300,2,FALSE),0)","v":0},{"$f":"IFERROR(VLOOKUP(C422,ELIST!$A$2:$E$300,5,FALSE),0)","v":0}]
["000000001002472283","Gen, HMI Computer","SC_HMIPC","HMI Computer",{"$f":"IFERROR(VLOOKUP(C423,ELIST!$A$2:$E$300,2,FALSE),0)","v":0},{"$f":"IFERROR(VLOOKUP(C423,ELIST!$A$2:$E$300,5,FALSE),0)","v":0}]
["000000001002472284","Gen, CPU or Communications Module","SC_CPU","CPU or Comms Module",{"$f":"IFERROR(VLOOKUP(C424,ELIST!$A$2:$E$300,2,FALSE),0)","v":0},{"$f":"IFERROR(VLOOKUP(C424,ELIST!$A$2:$E$300,5,FALSE),0)","v":0}]
["000000001002472285","Gen, Pump Set","CV_PUMPST","Pump Set",{"$f":"IFERROR(VLOOKUP(C425,ELIST!$A$2:$E$300,2,FALSE),0)","v":0},{"$f":"IFERROR(VLOOKUP(C425,ELIST!$A$2:$E$300,5,FALSE),0)","v":0}]
["000000001002472286","Gen, Crane - Gantry - ZS","CN_CRNGNT","Crane - Gantry - ZS",{"$f":"IFERROR(VLOOKUP(C426,ELIST!$A$2:$E$300,2,FALSE),0)","v":0},{"$f":"IFERROR(VLOOKUP(C426,ELIST!$A$2:$E$300,5,FALSE),0)","v":0}]
["000000001002472287","Gen, GRN Radio","TO_GRNRAD","GRN Radio",{"$f":"IFERROR(VLOOKUP(C427,ELIST!$A$2:$E$300,2,FALSE),0)","v":0},{"$f":"IFERROR(VLOOKUP(C427,ELIST!$A$2:$E$300,5,FALSE),0)","v":0}]
["000000001002472288","Gen, HMI Screen","SC_HMISCR","HMI Screen",{"$f":"IFERROR(VLOOKUP(C428,ELIST!$A$2:$E$300,2,FALSE),0)","v":0},{"$f":"IFERROR(VLOOKUP(C428,ELIST!$A$2:$E$300,5,FALSE),0)","v":0}]
["000000001002477154","MAKITA 18V ANGLE GRINDER","TO_TBATT","Tool Battery Powered",{"$f":"IFERROR(VLOOKUP(C429,ELIST!$A$2:$E$300,2,FALSE),0)","v":0},{"$f":"IFERROR(VLOOKUP(C429,ELIST!$A$2:$E$300,5,FALSE),0)","v":0}]
["000000001002477155","MAKITA 18V ANGLE GRINDER","TO_TBATT","Tool Battery Powered",{"$f":"IFERROR(VLOOKUP(C430,ELIST!$A$2:$E$300,2,FALSE),0)","v":0},{"$f":"IFERROR(VLOOKUP(C430,ELIST!$A$2:$E$300,5,FALSE),0)","v":0}]
["000000001002494663","Do not use created by mistake","TO_HAND","Hand Tools",{"$f":"IFERROR(VLOOKUP(C431,ELIST!$A$2:$E$300,2,FALSE),0)","v":0},{"$f":"IFERROR(VLOOKUP(C431,ELIST!$A$2:$E$300,5,FALSE),0)","v":0}]
["000000001005124779","RAISED IN ERROR CAT R SHOULD BE N","HS_LADDER","Ladder and Platform",{"$f":"IFERROR(VLOOKUP(C432,ELIST!$A$2:$E$300,2,FALSE),0)","v":0},{"$f":"IFERROR(VLOOKUP(C432,ELIST!$A$2:$E$300,5,FALSE),0)","v":0}]
["000000001005126279","RAISED IN ERROR CAT R SHOULD BE N","HS_LADDER","Ladder and Platform",{"$f":"IFERROR(VLOOKUP(C433,ELIST!$A$2:$E$300,2,FALSE),0)","v":0},{"$f":"IFERROR(VLOOKUP(C433,ELIST!$A$2:$E$300,5,FALSE),0)","v":0}]
["000000001005126280","RAISED IN ERROR CAT R SHOULD BE N","HS_LADDER","Ladder and Platform",{"$f":"IFERROR(VLOOKUP(C434,ELIST!$A$2:$E$300,2,FALSE),0)","v":0},{"$f":"IFERROR(VLOOKUP(C434,ELIST!$A$2:$E$300,5,FALSE),0)","v":0}]
["000000001005126281","Ladder 4-6.4  M Vaha vegetation","HS_LADDER","Ladder and Platform",{"$f":"IFERROR(VLOOKUP(C435,ELIST!$A$2:$E$300,2,FALSE),0)","v":0},{"$f":"IFERROR(VLOOKUP(C435,ELIST!$A$2:$E$300,5,FALSE),0)","v":0}]
["000000001005126298","ladder 4-6.4   B.Star","HS_LADDER","Ladder and Platform",{"$f":"IFERROR(VLOOKUP(C436,ELIST!$A$2:$E$300,2,FALSE),0)","v":0},{"$f":"IFERROR(VLOOKUP(C436,ELIST!$A$2:$E$300,5,FALSE),0)","v":0}]
["000000001005130665","RAISED IN ERROR","TO_MISCTL","Miscellaneous Tool",{"$f":"IFERROR(VLOOKUP(C437,ELIST!$A$2:$E$300,2,FALSE),0)","v":0},{"$f":"IFERROR(VLOOKUP(C437,ELIST!$A$2:$E$300,5,FALSE),0)","v":0}]
["000000001005137021","raised in error","TO_MISCTL","Miscellaneous Tool",{"$f":"IFERROR(VLOOKUP(C438,ELIST!$A$2:$E$300,2,FALSE),0)","v":0},{"$f":"IFERROR(VLOOKUP(C438,ELIST!$A$2:$E$300,5,FALSE),0)","v":0}]
["000000001005137022","OX Block Andrew Sant Kandos","TO_MISCTL","Miscellaneous Tool",{"$f":"IFERROR(VLOOKUP(C439,ELIST!$A$2:$E$300,2,FALSE),0)","v":0},{"$f":"IFERROR(VLOOKUP(C439,ELIST!$A$2:$E$300,5,FALSE),0)","v":0}]
["000000001005138948","Chain saw. stihl MS50cm  A.Sant Kandos","TO_MISCTL","Miscellaneous Tool",{"$f":"IFERROR(VLOOKUP(C440,ELIST!$A$2:$E$300,2,FALSE),0)","v":0},{"$f":"IFERROR(VLOOKUP(C440,ELIST!$A$2:$E$300,5,FALSE),0)","v":0}]
["000000001005270329","Gen, First Aid Defibrlltr","FA_DEFIB","First Aid Defibrlltr",{"$f":"IFERROR(VLOOKUP(C441,ELIST!$A$2:$E$300,2,FALSE),0)","v":0},{"$f":"IFERROR(VLOOKUP(C441,ELIST!$A$2:$E$300,5,FALSE),0)","v":0}]
["000000001005287235","Line stick with extension J.Woolsey","TO_MISCTL","Miscellaneous Tool",{"$f":"IFERROR(VLOOKUP(C442,ELIST!$A$2:$E$300,2,FALSE),0)","v":0},{"$f":"IFERROR(VLOOKUP(C442,ELIST!$A$2:$E$300,5,FALSE),0)","v":0}]
["000000001005380586","Chainsaw T.Cameron STIHL MS201TC","TO_PETROL","Tool Petrol Powered",{"$f":"IFERROR(VLOOKUP(C443,ELIST!$A$2:$E$300,2,FALSE),0)","v":0},{"$f":"IFERROR(VLOOKUP(C443,ELIST!$A$2:$E$300,5,FALSE),0)","v":0}]
["000000001005505717","Tool Petrol Powered","TO_PETROL","Tool Petrol Powered",{"$f":"IFERROR(VLOOKUP(C444,ELIST!$A$2:$E$300,2,FALSE),0)","v":0},{"$f":"IFERROR(VLOOKUP(C444,ELIST!$A$2:$E$300,5,FALSE),0)","v":0}]
["000000001002471861","Gen, Earth Wire","OH_EWIRE","Earth Wire Assembly",{"$f":"IFERROR(VLOOKUP(C445,ELIST!$A$2:$E$300,2,FALSE),0)","v":"ASSM"},{"$f":"IFERROR(VLOOKUP(C445,ELIST!$A$2:$E$300,5,FALSE),0)","v":0}]
["000000001002471907","Gen, HV Overhead Assembly","OH_HVASSM","HV Overhead Assembly",{"$f":"IFERROR(VLOOKUP(C446,ELIST!$A$2:$E$300,2,FALSE),0)","v":"ASSM"},{"$f":"IFERROR(VLOOKUP(C446,ELIST!$A$2:$E$300,5,FALSE),0)","v":0}]
["000000001002471908","HV OH Assembly - Non Crossarm - ABC","OH_HVASSM","HV Overhead Assembly",{"$f":"IFERROR(VLOOKUP(C447,ELIST!$A$2:$E$300,2,FALSE),0)","v":"ASSM"},{"$f":"IFERROR(VLOOKUP(C447,ELIST!$A$2:$E$300,5,FALSE),0)","v":0}]
["000000001002471909","HV OH Assy - Crossarm Type - ABC","OH_HVASSM","HV Overhead Assembly",{"$f":"IFERROR(VLOOKUP(C448,ELIST!$A$2:$E$300,2,FALSE),0)","v":"ASSM"},{"$f":"IFERROR(VLOOKUP(C448,ELIST!$A$2:$E$300,5,FALSE),0)","v":0}]
["000000001002471910","HV OH Assy - Non Crossarm - Bare","OH_HVASSM","HV Overhead Assembly",{"$f":"IFERROR(VLOOKUP(C449,ELIST!$A$2:$E$300,2,FALSE),0)","v":"ASSM"},{"$f":"IFERROR(VLOOKUP(C449,ELIST!$A$2:$E$300,5,FALSE),0)","v":0}]
["000000001002471911","HV OH Assy - Crossarm Type - Bare","OH_HVASSM","HV Overhead Assembly",{"$f":"IFERROR(VLOOKUP(C450,ELIST!$A$2:$E$300,2,FALSE),0)","v":"ASSM"},{"$f":"IFERROR(VLOOKUP(C450,ELIST!$A$2:$E$300,5,FALSE),0)","v":0}]
["000000001002471912","HV OH Assembly - Non Crossarm - CCT","OH_HVASSM","HV Overhead Assembly",{"$f":"IFERROR(VLOOKUP(C451,ELIST!$A$2:$E$300,2,FALSE),0)","v":"ASSM"},{"$f":"IFERROR(VLOOKUP(C451,ELIST!$A$2:$E$300,5,FALSE),0)","v":0}]
["000000001002471913","HV OH Assy - Crossarm Type - CCT","OH_HVASSM","HV Overhead Assembly",{"$f":"IFERROR(VLOOKUP(C452,ELIST!$A$2:$E$300,2,FALSE),0)","v":"ASSM"},{"$f":"IFERROR(VLOOKUP(C452,ELIST!$A$2:$E$300,5,FALSE),0)","v":0}]
["000000001002471987","Gen, LV Overhead Assembly","OH_LVASSM","LV Overhead Assembly",{"$f":"IFERROR(VLOOKUP(C453,ELIST!$A$2:$E$300,2,FALSE),0)","v":"ASSM"},{"$f":"IFERROR(VLOOKUP(C453,ELIST!$A$2:$E$300,5,FALSE),0)","v":0}]
["000000001002471988","LV OH Assembly - Non Xarm - ABC","OH_LVASSM","LV Overhead Assembly",{"$f":"IFERROR(VLOOKUP(C454,ELIST!$A$2:$E$300,2,FALSE),0)","v":"ASSM"},{"$f":"IFERROR(VLOOKUP(C454,ELIST!$A$2:$E$300,5,FALSE),0)","v":0}]
["000000001002471989","LV OH Assembly - Xarm Type - ABC","OH_LVASSM","LV Overhead Assembly",{"$f":"IFERROR(VLOOKUP(C455,ELIST!$A$2:$E$300,2,FALSE),0)","v":"ASSM"},{"$f":"IFERROR(VLOOKUP(C455,ELIST!$A$2:$E$300,5,FALSE),0)","v":0}]
["000000001002471990","LV OH Assembly - Non Xarm - Bare","OH_LVASSM","LV Overhead Assembly",{"$f":"IFERROR(VLOOKUP(C456,ELIST!$A$2:$E$300,2,FALSE),0)","v":"ASSM"},{"$f":"IFERROR(VLOOKUP(C456,ELIST!$A$2:$E$300,5,FALSE),0)","v":0}]
["000000001002471991","LV OH Assembly - Xarm Type - Bare","OH_LVASSM","LV Overhead Assembly",{"$f":"IFERROR(VLOOKUP(C457,ELIST!$A$2:$E$300,2,FALSE),0)","v":"ASSM"},{"$f":"IFERROR(VLOOKUP(C457,ELIST!$A$2:$E$300,5,FALSE),0)","v":0}]
["000000001002472032","Gen, OPGW","OH_OPGW","OPGW",{"$f":"IFERROR(VLOOKUP(C458,ELIST!$A$2:$E$300,2,FALSE),0)","v":"ASSM"},{"$f":"IFERROR(VLOOKUP(C458,ELIST!$A$2:$E$300,5,FALSE),0)","v":0}]
["000000001002472062","Gen, Pilot Cable","OH_PILOT","Pilot Cable",{"$f":"IFERROR(VLOOKUP(C459,ELIST!$A$2:$E$300,2,FALSE),0)","v":"ASSM"},{"$f":"IFERROR(VLOOKUP(C459,ELIST!$A$2:$E$300,5,FALSE),0)","v":0}]
["000000001002472193","Gen, TR Overhead Assembly","OH_TRASSM","TR Overhead Assembly",{"$f":"IFERROR(VLOOKUP(C460,ELIST!$A$2:$E$300,2,FALSE),0)","v":"ASSM"},{"$f":"IFERROR(VLOOKUP(C460,ELIST!$A$2:$E$300,5,FALSE),0)","v":0}]
["000000001002472194","Transmission OH Assembly - Crossarm","OH_TRASSM","TR Overhead Assembly",{"$f":"IFERROR(VLOOKUP(C461,ELIST!$A$2:$E$300,2,FALSE),0)","v":"ASSM"},{"$f":"IFERROR(VLOOKUP(C461,ELIST!$A$2:$E$300,5,FALSE),0)","v":0}]
["000000001002472195","Transmission OH Assy - Non Crossarm","OH_TRASSM","TR Overhead Assembly",{"$f":"IFERROR(VLOOKUP(C462,ELIST!$A$2:$E$300,2,FALSE),0)","v":"ASSM"},{"$f":"IFERROR(VLOOKUP(C462,ELIST!$A$2:$E$300,5,FALSE),0)","v":0}]
["000000001002472212","Gen, UG/OH Termination","OH_UGOH","UG/OH Termination",{"$f":"IFERROR(VLOOKUP(C463,ELIST!$A$2:$E$300,2,FALSE),0)","v":"ASSM"},{"$f":"IFERROR(VLOOKUP(C463,ELIST!$A$2:$E$300,5,FALSE),0)","v":0}]
["000000001002472214","Gen, UG Termination","GD_UGTERM","UG Termination",{"$f":"IFERROR(VLOOKUP(C464,ELIST!$A$2:$E$300,2,FALSE),0)","v":"ASSM"},{"$f":"IFERROR(VLOOKUP(C464,ELIST!$A$2:$E$300,5,FALSE),0)","v":0}]
["000000001002472215","Termination UG - LV Mains Bolted","GD_UGTERM","UG Termination",{"$f":"IFERROR(VLOOKUP(C465,ELIST!$A$2:$E$300,2,FALSE),0)","v":"ASSM"},{"$f":"IFERROR(VLOOKUP(C465,ELIST!$A$2:$E$300,5,FALSE),0)","v":0}]
["000000001002472216","Termination UG LV Mains- Panel","GD_UGTERM","UG Termination",{"$f":"IFERROR(VLOOKUP(C466,ELIST!$A$2:$E$300,2,FALSE),0)","v":"ASSM"},{"$f":"IFERROR(VLOOKUP(C466,ELIST!$A$2:$E$300,5,FALSE),0)","v":0}]
["000000001002472217","Termination UG - LV Service Mains","GD_UGTERM","UG Termination",{"$f":"IFERROR(VLOOKUP(C467,ELIST!$A$2:$E$300,2,FALSE),0)","v":"ASSM"},{"$f":"IFERROR(VLOOKUP(C467,ELIST!$A$2:$E$300,5,FALSE),0)","v":0}]
["000000001002472218","Termination UG - SL Mains","GD_UGTERM","UG Termination",{"$f":"IFERROR(VLOOKUP(C468,ELIST!$A$2:$E$300,2,FALSE),0)","v":"ASSM"},{"$f":"IFERROR(VLOOKUP(C468,ELIST!$A$2:$E$300,5,FALSE),0)","v":0}]
["000000001002471798","Gen, Column Concrete (SL)","CL_CNSLCL","Column Concrete (SL)",{"$f":"IFERROR(VLOOKUP(C469,ELIST!$A$2:$E$300,2,FALSE),0)","v":"COLUMN"},{"$f":"IFERROR(VLOOKUP(C469,ELIST!$A$2:$E$300,5,FALSE),0)","v":0}]
["000000001002472142","Gen, Column Steel (LV)","CL_STLVCL","Column Steel (LV)",{"$f":"IFERROR(VLOOKUP(C470,ELIST!$A$2:$E$300,2,FALSE),0)","v":"COLUMN"},{"$f":"IFERROR(VLOOKUP(C470,ELIST!$A$2:$E$300,5,FALSE),0)","v":0}]
["000000001002472143","Column Steel (LV) - Minor","CL_STLVCL","Column Steel (LV)",{"$f":"IFERROR(VLOOKUP(C471,ELIST!$A$2:$E$300,2,FALSE),0)","v":"COLUMN"},{"$f":"IFERROR(VLOOKUP(C471,ELIST!$A$2:$E$300,5,FALSE),0)","v":0}]
["000000001002472144","Column Steel (LV) - Major","CL_STLVCL","Column Steel (LV)",{"$f":"IFERROR(VLOOKUP(C472,ELIST!$A$2:$E$300,2,FALSE),0)","v":"COLUMN"},{"$f":"IFERROR(VLOOKUP(C472,ELIST!$A$2:$E$300,5,FALSE),0)","v":0}]
["000000001002472145","Column Top Extension 2m","CL_STLVCL","Column Steel (LV)",{"$f":"IFERROR(VLOOKUP(C473,ELIST!$A$2:$E$300,2,FALSE),0)","v":"COLUMN"},{"$f":"IFERROR(VLOOKUP(C473,ELIST!$A$2:$E$300,5,FALSE),0)","v":0}]
["000000001002472148","Gen, Column Steel (SL)","CL_STSLCL","Column Steel (SL)",{"$f":"IFERROR(VLOOKUP(C474,ELIST!$A$2:$E$300,2,FALSE),0)","v":"COLUMN"},{"$f":"IFERROR(VLOOKUP(C474,ELIST!$A$2:$E$300,5,FALSE),0)","v":0}]
["000000001002472149","Column Steel (SL) - Minor","CL_STSLCL","Column Steel (SL)",{"$f":"IFERROR(VLOOKUP(C475,ELIST!$A$2:$E$300,2,FALSE),0)","v":"COLUMN"},{"$f":"IFERROR(VLOOKUP(C475,ELIST!$A$2:$E$300,5,FALSE),0)","v":0}]
["000000001002472150","Column Steel (SL) - Major","CL_STSLCL","Column Steel (SL)",{"$f":"IFERROR(VLOOKUP(C476,ELIST!$A$2:$E$300,2,FALSE),0)","v":"COLUMN"},{"$f":"IFERROR(VLOOKUP(C476,ELIST!$A$2:$E$300,5,FALSE),0)","v":0}]
["000000001002472155","Gen, Switch Controller","CM_SWCTRL","Switch Controller",{"$f":"IFERROR(VLOOKUP(C477,ELIST!$A$2:$E$300,2,FALSE),0)","v":"CTRL"},{"$f":"IFERROR(VLOOKUP(C477,ELIST!$A$2:$E$300,5,FALSE),0)","v":0}]
["000000001002471751","Gen, Brick Enclosure","CV_BRKENC","Brick Enclosure",{"$f":"IFERROR(VLOOKUP(C478,ELIST!$A$2:$E$300,2,FALSE),0)","v":"DSUBGRNDBEN"},{"$f":"IFERROR(VLOOKUP(C478,ELIST!$A$2:$E$300,5,FALSE),0)","v":0}]
["000000001002471796","Gen, Composite Cubicle","CV_CMPCUB","Composite Cubicle",{"$f":"IFERROR(VLOOKUP(C479,ELIST!$A$2:$E$300,2,FALSE),0)","v":"DSUBGRNDCMCU"},{"$f":"IFERROR(VLOOKUP(C479,ELIST!$A$2:$E$300,5,FALSE),0)","v":0}]
["000000001002471852","Gen, Emergency Exit Light","FE_EMEXLT","Emergency Exit Light",{"$f":"IFERROR(VLOOKUP(C480,ELIST!$A$2:$E$300,2,FALSE),0)","v":"DSUBGRNDEME"},{"$f":"IFERROR(VLOOKUP(C480,ELIST!$A$2:$E$300,5,FALSE),0)","v":0}]
["000000001002471876","Gen, Fire Blankets - Dry","FE_FBLDRY","Fire Blankets - Dry",{"$f":"IFERROR(VLOOKUP(C481,ELIST!$A$2:$E$300,2,FALSE),0)","v":"DSUBGRNDFBD"},{"$f":"IFERROR(VLOOKUP(C481,ELIST!$A$2:$E$300,5,FALSE),0)","v":0}]
["000000001002471884","Gen, Fire Extinguisher","FE_FEXTGH","Fire Extinguisher",{"$f":"IFERROR(VLOOKUP(C482,ELIST!$A$2:$E$300,2,FALSE),0)","v":"DSUBGRNDFEX"},{"$f":"IFERROR(VLOOKUP(C482,ELIST!$A$2:$E$300,5,FALSE),0)","v":0}]
["000000001002471885","Fire Extnguisher Pos","FE_FEXTGH","Fire Extinguisher",{"$f":"IFERROR(VLOOKUP(C483,ELIST!$A$2:$E$300,2,FALSE),0)","v":"DSUBGRNDFEX"},{"$f":"IFERROR(VLOOKUP(C483,ELIST!$A$2:$E$300,5,FALSE),0)","v":0}]
["000000001002471840","Gen, Door - Standard","CV_DRSTD","Door - Standard",{"$f":"IFERROR(VLOOKUP(C484,ELIST!$A$2:$E$300,2,FALSE),0)","v":"DSUBGRNDRSTD"},{"$f":"IFERROR(VLOOKUP(C484,ELIST!$A$2:$E$300,5,FALSE),0)","v":0}]
["000000001002472135","Gen, Surge Diverters","SE_SRGDIV","Surge Diverters",{"$f":"IFERROR(VLOOKUP(C485,ELIST!$A$2:$E$300,2,FALSE),0)","v":"DSUBPOLESRG"},{"$f":"IFERROR(VLOOKUP(C485,ELIST!$A$2:$E$300,5,FALSE),0)","v":0}]
["000000001002472136","Surge Diverters - Pole Mount - Polymeric","SE_SRGDIV","Surge Diverters",{"$f":"IFERROR(VLOOKUP(C486,ELIST!$A$2:$E$300,2,FALSE),0)","v":"DSUBPOLESRG"},{"$f":"IFERROR(VLOOKUP(C486,ELIST!$A$2:$E$300,5,FALSE),0)","v":0}]
["000000001002472137","Surge Diverters - Pole Mount - Porcelain","SE_SRGDIV","Surge Diverters",{"$f":"IFERROR(VLOOKUP(C487,ELIST!$A$2:$E$300,2,FALSE),0)","v":"DSUBPOLESRG"},{"$f":"IFERROR(VLOOKUP(C487,ELIST!$A$2:$E$300,5,FALSE),0)","v":0}]
["000000001005793908","Surge Diverter - 11kV","SE_SRGDIV","Surge Diverters",{"$f":"IFERROR(VLOOKUP(C488,ELIST!$A$2:$E$300,2,FALSE),0)","v":"DSUBPOLESRG"},{"$f":"IFERROR(VLOOKUP(C488,ELIST!$A$2:$E$300,5,FALSE),0)","v":0}]
["000000001002471723","Air Break Switch - Distribution","SW_ABS","Air Break Switch",{"$f":"IFERROR(VLOOKUP(C489,ELIST!$A$2:$E$300,2,FALSE),0)","v":"HVSWITCHES"},{"$f":"IFERROR(VLOOKUP(C489,ELIST!$A$2:$E$300,5,FALSE),0)","v":0}]
["000000001002471724","Air Break Switch - Transmission","SW_ABS","Air Break Switch",{"$f":"IFERROR(VLOOKUP(C490,ELIST!$A$2:$E$300,2,FALSE),0)","v":"HVSWITCHES"},{"$f":"IFERROR(VLOOKUP(C490,ELIST!$A$2:$E$300,5,FALSE),0)","v":0}]
["000000001002471778","Gen, LV Circuit Breaker - Pole Mounted","CB_CBLVPL","CB - LV - PL",{"$f":"IFERROR(VLOOKUP(C491,ELIST!$A$2:$E$300,2,FALSE),0)","v":"HVSWITCHES"},{"$f":"IFERROR(VLOOKUP(C491,ELIST!$A$2:$E$300,5,FALSE),0)","v":0}]
["000000001002471821","Gen, Direct Con - LV - GD","DG_DCLVGD","Direct Con - LV - GD",{"$f":"IFERROR(VLOOKUP(C492,ELIST!$A$2:$E$300,2,FALSE),0)","v":"HVSWITCHES"},{"$f":"IFERROR(VLOOKUP(C492,ELIST!$A$2:$E$300,5,FALSE),0)","v":0}]
["000000001002471822","Gen, Direct Con - LV - PL","DG_DCLVPL","Direct Con - LV - PL",{"$f":"IFERROR(VLOOKUP(C493,ELIST!$A$2:$E$300,2,FALSE),0)","v":"HVSWITCHES"},{"$f":"IFERROR(VLOOKUP(C493,ELIST!$A$2:$E$300,5,FALSE),0)","v":0}]
["000000001002471823","LV Direct Connection - Pole Substation","DG_DCLVPL","Direct Con - LV - PL",{"$f":"IFERROR(VLOOKUP(C494,ELIST!$A$2:$E$300,2,FALSE),0)","v":"HVSWITCHES"},{"$f":"IFERROR(VLOOKUP(C494,ELIST!$A$2:$E$300,5,FALSE),0)","v":0}]
["000000001002471830","Drop Out Fuse (Boric) - Porcelain","SW_DOFPL","Drop Out Fuse Pole",{"$f":"IFERROR(VLOOKUP(C495,ELIST!$A$2:$E$300,2,FALSE),0)","v":"HVSWITCHES"},{"$f":"IFERROR(VLOOKUP(C495,ELIST!$A$2:$E$300,5,FALSE),0)","v":0}]
["000000001002471831","Drop Out Fuse (Wired) - Poly","SW_DOFPL","Drop Out Fuse Pole",{"$f":"IFERROR(VLOOKUP(C496,ELIST!$A$2:$E$300,2,FALSE),0)","v":"HVSWITCHES"},{"$f":"IFERROR(VLOOKUP(C496,ELIST!$A$2:$E$300,5,FALSE),0)","v":0}]
["000000001002471832","Drop Out Fuse (Wired) - Porcelain","SW_DOFPL","Drop Out Fuse Pole",{"$f":"IFERROR(VLOOKUP(C497,ELIST!$A$2:$E$300,2,FALSE),0)","v":"HVSWITCHES"},{"$f":"IFERROR(VLOOKUP(C497,ELIST!$A$2:$E$300,5,FALSE),0)","v":0}]
["000000001002471833","Gen, Drop Out Fuse - Other","SW_DOFPL","Drop Out Fuse Pole",{"$f":"IFERROR(VLOOKUP(C498,ELIST!$A$2:$E$300,2,FALSE),0)","v":"HVSWITCHES"},{"$f":"IFERROR(VLOOKUP(C498,ELIST!$A$2:$E$300,5,FALSE),0)","v":0}]
["000000001002471834","Drop Out Fuse PL Sub","SW_DOFSUB","Drop Out Fuse PL Sub",{"$f":"IFERROR(VLOOKUP(C499,ELIST!$A$2:$E$300,2,FALSE),0)","v":"HVSWITCHES"},{"$f":"IFERROR(VLOOKUP(C499,ELIST!$A$2:$E$300,5,FALSE),0)","v":0}]
["000000001002471835","Drop Out Fuse (Boric) - Porcelain","SW_DOFSUB","Drop Out Fuse PL Sub",{"$f":"IFERROR(VLOOKUP(C500,ELIST!$A$2:$E$300,2,FALSE),0)","v":"HVSWITCHES"},{"$f":"IFERROR(VLOOKUP(C500,ELIST!$A$2:$E$300,5,FALSE),0)","v":0}]
["000000001002471836","Drop Out Fuse (Wired) - Poly","SW_DOFSUB","Drop Out Fuse PL Sub",{"$f":"IFERROR(VLOOKUP(C501,ELIST!$A$2:$E$300,2,FALSE),0)","v":"HVSWITCHES"},{"$f":"IFERROR(VLOOKUP(C501,ELIST!$A$2:$E$300,5,FALSE),0)","v":0}]
["000000001002471837","Drop Out Fuse (Wired) - Porcelain","SW_DOFSUB","Drop Out Fuse PL Sub",{"$f":"IFERROR(VLOOKUP(C502,ELIST!$A$2:$E$300,2,FALSE),0)","v":"HVSWITCHES"},{"$f":"IFERROR(VLOOKUP(C502,ELIST!$A$2:$E$300,5,FALSE),0)","v":0}]
["000000001002471838","Gen, Drop Out Fuse - Other","SW_DOFSUB","Drop Out Fuse PL Sub",{"$f":"IFERROR(VLOOKUP(C503,ELIST!$A$2:$E$300,2,FALSE),0)","v":"HVSWITCHES"},{"$f":"IFERROR(VLOOKUP(C503,ELIST!$A$2:$E$300,5,FALSE),0)","v":0}]
["000000001002471893","Gen, Fuse Saver","SW_FUSAVR","Fuse Saver",{"$f":"IFERROR(VLOOKUP(C504,ELIST!$A$2:$E$300,2,FALSE),0)","v":"HVSWITCHES"},{"$f":"IFERROR(VLOOKUP(C504,ELIST!$A$2:$E$300,5,FALSE),0)","v":0}]
["000000001002471898","Gen, Generator Link - LV","DG_GENLK","Generator Link - LV",{"$f":"IFERROR(VLOOKUP(C505,ELIST!$A$2:$E$300,2,FALSE),0)","v":"HVSWITCHES"},{"$f":"IFERROR(VLOOKUP(C505,ELIST!$A$2:$E$300,5,FALSE),0)","v":0}]
["000000001002471940","Gen, Isol/Disc - LV - GD","DG_ISLVGD","Isol/Disc - LV - GD",{"$f":"IFERROR(VLOOKUP(C506,ELIST!$A$2:$E$300,2,FALSE),0)","v":"HVSWITCHES"},{"$f":"IFERROR(VLOOKUP(C506,ELIST!$A$2:$E$300,5,FALSE),0)","v":0}]
["000000001002471941","Gen, Isol No Load Br - LV","DG_ISNLLV","Isol No Load Br - LV",{"$f":"IFERROR(VLOOKUP(C507,ELIST!$A$2:$E$300,2,FALSE),0)","v":"HVSWITCHES"},{"$f":"IFERROR(VLOOKUP(C507,ELIST!$A$2:$E$300,5,FALSE),0)","v":0}]
["000000001002471949","Gen, Knife Switch - LV","DG_KNFLV","Knife Switch - LV",{"$f":"IFERROR(VLOOKUP(C508,ELIST!$A$2:$E$300,2,FALSE),0)","v":"HVSWITCHES"},{"$f":"IFERROR(VLOOKUP(C508,ELIST!$A$2:$E$300,5,FALSE),0)","v":0}]
["000000001002471954","Gen, Load Break Switch","SW_LBS","Load Break Switch",{"$f":"IFERROR(VLOOKUP(C509,ELIST!$A$2:$E$300,2,FALSE),0)","v":"HVSWITCHES"},{"$f":"IFERROR(VLOOKUP(C509,ELIST!$A$2:$E$300,5,FALSE),0)","v":0}]
["000000001002471955","Load Break Switch - Pole - Man Op","SW_LBS","Load Break Switch",{"$f":"IFERROR(VLOOKUP(C510,ELIST!$A$2:$E$300,2,FALSE),0)","v":"HVSWITCHES"},{"$f":"IFERROR(VLOOKUP(C510,ELIST!$A$2:$E$300,5,FALSE),0)","v":0}]
["000000001002471956","Load Break Switch - Pole - Auto Op","SW_LBS","Load Break Switch",{"$f":"IFERROR(VLOOKUP(C511,ELIST!$A$2:$E$300,2,FALSE),0)","v":"HVSWITCHES"},{"$f":"IFERROR(VLOOKUP(C511,ELIST!$A$2:$E$300,5,FALSE),0)","v":0}]
["000000001002471969","Gen, Link","SW_LINK","Link",{"$f":"IFERROR(VLOOKUP(C512,ELIST!$A$2:$E$300,2,FALSE),0)","v":"HVSWITCHES"},{"$f":"IFERROR(VLOOKUP(C512,ELIST!$A$2:$E$300,5,FALSE),0)","v":0}]
["000000001002471970","Links - PL Mounted","SW_LINK","Link",{"$f":"IFERROR(VLOOKUP(C513,ELIST!$A$2:$E$300,2,FALSE),0)","v":"HVSWITCHES"},{"$f":"IFERROR(VLOOKUP(C513,ELIST!$A$2:$E$300,5,FALSE),0)","v":0}]
["000000001002471971","Gen, Link/Fuse PL Mount","SW_LINKF","Link/Fuse",{"$f":"IFERROR(VLOOKUP(C514,ELIST!$A$2:$E$300,2,FALSE),0)","v":"HVSWITCHES"},{"$f":"IFERROR(VLOOKUP(C514,ELIST!$A$2:$E$300,5,FALSE),0)","v":0}]
["000000001002471993","Gen, LV Links","SW_LVLINK","LV Links",{"$f":"IFERROR(VLOOKUP(C515,ELIST!$A$2:$E$300,2,FALSE),0)","v":"HVSWITCHES"},{"$f":"IFERROR(VLOOKUP(C515,ELIST!$A$2:$E$300,5,FALSE),0)","v":0}]
["000000001002471994","LV Double Switch Panel - Column","SW_LVLINK","LV Links",{"$f":"IFERROR(VLOOKUP(C516,ELIST!$A$2:$E$300,2,FALSE),0)","v":"HVSWITCHES"},{"$f":"IFERROR(VLOOKUP(C516,ELIST!$A$2:$E$300,5,FALSE),0)","v":0}]
["000000001002471995","LV Sng Switch Panel - Column","SW_LVLINK","LV Links",{"$f":"IFERROR(VLOOKUP(C517,ELIST!$A$2:$E$300,2,FALSE),0)","v":"HVSWITCHES"},{"$f":"IFERROR(VLOOKUP(C517,ELIST!$A$2:$E$300,5,FALSE),0)","v":0}]
["000000001002472111","Gen, Recloser","SW_RECL","Recloser",{"$f":"IFERROR(VLOOKUP(C518,ELIST!$A$2:$E$300,2,FALSE),0)","v":"HVSWITCHES"},{"$f":"IFERROR(VLOOKUP(C518,ELIST!$A$2:$E$300,5,FALSE),0)","v":0}]
["000000001002472122","Gen, Sectionaliser","SW_SECT","Sectionaliser",{"$f":"IFERROR(VLOOKUP(C519,ELIST!$A$2:$E$300,2,FALSE),0)","v":"HVSWITCHES"},{"$f":"IFERROR(VLOOKUP(C519,ELIST!$A$2:$E$300,5,FALSE),0)","v":0}]
["000000001002472138","Gen, Steel Encl Swbd - LV","DG_SSWBLV","Steel Encl Swbd - LV",{"$f":"IFERROR(VLOOKUP(C520,ELIST!$A$2:$E$300,2,FALSE),0)","v":"HVSWITCHES"},{"$f":"IFERROR(VLOOKUP(C520,ELIST!$A$2:$E$300,5,FALSE),0)","v":0}]
["000000001002472156","Gen, Switch Fuse - LV","DG_SWFSLV","Switch Fuse - LV",{"$f":"IFERROR(VLOOKUP(C521,ELIST!$A$2:$E$300,2,FALSE),0)","v":"HVSWITCHES"},{"$f":"IFERROR(VLOOKUP(C521,ELIST!$A$2:$E$300,5,FALSE),0)","v":0}]
["000000001002472157","Gen, SW Fuse - LV - PL","DG_SWFSPL","Sw Fuse - LV - PL",{"$f":"IFERROR(VLOOKUP(C522,ELIST!$A$2:$E$300,2,FALSE),0)","v":"HVSWITCHES"},{"$f":"IFERROR(VLOOKUP(C522,ELIST!$A$2:$E$300,5,FALSE),0)","v":0}]
["000000001002472162","Gen, SW Load Break - LV","DG_SWLBLV","Sw Load Break - LV",{"$f":"IFERROR(VLOOKUP(C523,ELIST!$A$2:$E$300,2,FALSE),0)","v":"HVSWITCHES"},{"$f":"IFERROR(VLOOKUP(C523,ELIST!$A$2:$E$300,5,FALSE),0)","v":0}]
["000000001002472163","LV Isolator - PL Mounted","DG_SWLBLV","Sw Load Break - LV",{"$f":"IFERROR(VLOOKUP(C524,ELIST!$A$2:$E$300,2,FALSE),0)","v":"HVSWITCHES"},{"$f":"IFERROR(VLOOKUP(C524,ELIST!$A$2:$E$300,5,FALSE),0)","v":0}]
["000000001002472221","Gen, Under Slung Link","SW_USL","Under Slung Link",{"$f":"IFERROR(VLOOKUP(C525,ELIST!$A$2:$E$300,2,FALSE),0)","v":"HVSWITCHES"},{"$f":"IFERROR(VLOOKUP(C525,ELIST!$A$2:$E$300,5,FALSE),0)","v":0}]
["000000001002472222","HV Underslung Links - PL Mnt - Poly","SW_USL","Under Slung Link",{"$f":"IFERROR(VLOOKUP(C526,ELIST!$A$2:$E$300,2,FALSE),0)","v":"HVSWITCHES"},{"$f":"IFERROR(VLOOKUP(C526,ELIST!$A$2:$E$300,5,FALSE),0)","v":0}]
["000000001002472223","HV Underslung Links - PL Mnt - Porc","SW_USL","Under Slung Link",{"$f":"IFERROR(VLOOKUP(C527,ELIST!$A$2:$E$300,2,FALSE),0)","v":"HVSWITCHES"},{"$f":"IFERROR(VLOOKUP(C527,ELIST!$A$2:$E$300,5,FALSE),0)","v":0}]
["000000001002472253","Gen, Drop Out Fuse","SW_DOFPL","Drop Out Fuse Pole",{"$f":"IFERROR(VLOOKUP(C528,ELIST!$A$2:$E$300,2,FALSE),0)","v":"HVSWITCHES"},{"$f":"IFERROR(VLOOKUP(C528,ELIST!$A$2:$E$300,5,FALSE),0)","v":0}]
["000000001002472254","Gen, Air Break Switch","SW_ABS","Air Break Switch",{"$f":"IFERROR(VLOOKUP(C529,ELIST!$A$2:$E$300,2,FALSE),0)","v":"HVSWITCHES"},{"$f":"IFERROR(VLOOKUP(C529,ELIST!$A$2:$E$300,5,FALSE),0)","v":0}]
["000000001002471815","Gen, Cylinder Lock","LK_CYLNLK","Cylinder Lock",{"$f":"IFERROR(VLOOKUP(C530,ELIST!$A$2:$E$300,2,FALSE),0)","v":"LOCKA"},{"$f":"IFERROR(VLOOKUP(C530,ELIST!$A$2:$E$300,5,FALSE),0)","v":"DSUBGRNDLK"}]
["000000001002471816","Cylinder Lock D1","LK_CYLNLK","Cylinder Lock",{"$f":"IFERROR(VLOOKUP(C531,ELIST!$A$2:$E$300,2,FALSE),0)","v":"LOCKA"},{"$f":"IFERROR(VLOOKUP(C531,ELIST!$A$2:$E$300,5,FALSE),0)","v":"DSUBGRNDLK"}]
["000000001002471817","Cylinder Lock D2","LK_CYLNLK","Cylinder Lock",{"$f":"IFERROR(VLOOKUP(C532,ELIST!$A$2:$E$300,2,FALSE),0)","v":"LOCKA"},{"$f":"IFERROR(VLOOKUP(C532,ELIST!$A$2:$E$300,5,FALSE),0)","v":"DSUBGRNDLK"}]
["000000001002471818","Cylinder Lock D3","LK_CYLNLK","Cylinder Lock",{"$f":"IFERROR(VLOOKUP(C533,ELIST!$A$2:$E$300,2,FALSE),0)","v":"LOCKA"},{"$f":"IFERROR(VLOOKUP(C533,ELIST!$A$2:$E$300,5,FALSE),0)","v":"DSUBGRNDLK"}]
["000000001002471819","Cylinder Lock D4","LK_CYLNLK","Cylinder Lock",{"$f":"IFERROR(VLOOKUP(C534,ELIST!$A$2:$E$300,2,FALSE),0)","v":"LOCKA"},{"$f":"IFERROR(VLOOKUP(C534,ELIST!$A$2:$E$300,5,FALSE),0)","v":"DSUBGRNDLK"}]
["000000001002472036","Gen, Padlock","LK_PADLK","Padlock",{"$f":"IFERROR(VLOOKUP(C535,ELIST!$A$2:$E$300,2,FALSE),0)","v":"LOCKB"},{"$f":"IFERROR(VLOOKUP(C535,ELIST!$A$2:$E$300,5,FALSE),0)","v":"DSUBGRNDLK"}]
["000000001002472037","Padlock PL330 D1","LK_PADLK","Padlock",{"$f":"IFERROR(VLOOKUP(C536,ELIST!$A$2:$E$300,2,FALSE),0)","v":"LOCKB"},{"$f":"IFERROR(VLOOKUP(C536,ELIST!$A$2:$E$300,5,FALSE),0)","v":"DSUBGRNDLK"}]
["000000001002472038","Padlock PL330 D2","LK_PADLK","Padlock",{"$f":"IFERROR(VLOOKUP(C537,ELIST!$A$2:$E$300,2,FALSE),0)","v":"LOCKB"},{"$f":"IFERROR(VLOOKUP(C537,ELIST!$A$2:$E$300,5,FALSE),0)","v":"DSUBGRNDLK"}]
["000000001002472039","Padlock PL330 D3","LK_PADLK","Padlock",{"$f":"IFERROR(VLOOKUP(C538,ELIST!$A$2:$E$300,2,FALSE),0)","v":"LOCKB"},{"$f":"IFERROR(VLOOKUP(C538,ELIST!$A$2:$E$300,5,FALSE),0)","v":"DSUBGRNDLK"}]
["000000001002472040","Padlock PL330 D4","LK_PADLK","Padlock",{"$f":"IFERROR(VLOOKUP(C539,ELIST!$A$2:$E$300,2,FALSE),0)","v":"LOCKB"},{"$f":"IFERROR(VLOOKUP(C539,ELIST!$A$2:$E$300,5,FALSE),0)","v":"DSUBGRNDLK"}]
["000000001002472041","Padlock PL330 D5","LK_PADLK","Padlock",{"$f":"IFERROR(VLOOKUP(C540,ELIST!$A$2:$E$300,2,FALSE),0)","v":"LOCKB"},{"$f":"IFERROR(VLOOKUP(C540,ELIST!$A$2:$E$300,5,FALSE),0)","v":"DSUBGRNDLK"}]
["000000001002472042","Padlock PL330 D6","LK_PADLK","Padlock",{"$f":"IFERROR(VLOOKUP(C541,ELIST!$A$2:$E$300,2,FALSE),0)","v":"LOCKB"},{"$f":"IFERROR(VLOOKUP(C541,ELIST!$A$2:$E$300,5,FALSE),0)","v":"DSUBGRNDLK"}]
["000000001002472043","Padlock PL330 D7","LK_PADLK","Padlock",{"$f":"IFERROR(VLOOKUP(C542,ELIST!$A$2:$E$300,2,FALSE),0)","v":"LOCKB"},{"$f":"IFERROR(VLOOKUP(C542,ELIST!$A$2:$E$300,5,FALSE),0)","v":"DSUBGRNDLK"}]
["000000001002472044","Padlock PL330 D8","LK_PADLK","Padlock",{"$f":"IFERROR(VLOOKUP(C543,ELIST!$A$2:$E$300,2,FALSE),0)","v":"LOCKB"},{"$f":"IFERROR(VLOOKUP(C543,ELIST!$A$2:$E$300,5,FALSE),0)","v":"DSUBGRNDLK"}]
["000000001002472045","Padlock PL330 D9","LK_PADLK","Padlock",{"$f":"IFERROR(VLOOKUP(C544,ELIST!$A$2:$E$300,2,FALSE),0)","v":"LOCKB"},{"$f":"IFERROR(VLOOKUP(C544,ELIST!$A$2:$E$300,5,FALSE),0)","v":"DSUBGRNDLK"}]
["000000001002472046","Padlock PL330 D10","LK_PADLK","Padlock",{"$f":"IFERROR(VLOOKUP(C545,ELIST!$A$2:$E$300,2,FALSE),0)","v":"LOCKB"},{"$f":"IFERROR(VLOOKUP(C545,ELIST!$A$2:$E$300,5,FALSE),0)","v":"DSUBGRNDLK"}]
["000000001002472047","Padlock PL330 D11","LK_PADLK","Padlock",{"$f":"IFERROR(VLOOKUP(C546,ELIST!$A$2:$E$300,2,FALSE),0)","v":"LOCKB"},{"$f":"IFERROR(VLOOKUP(C546,ELIST!$A$2:$E$300,5,FALSE),0)","v":"DSUBGRNDLK"}]
["000000001002472048","Padlock PL330 D12","LK_PADLK","Padlock",{"$f":"IFERROR(VLOOKUP(C547,ELIST!$A$2:$E$300,2,FALSE),0)","v":"LOCKB"},{"$f":"IFERROR(VLOOKUP(C547,ELIST!$A$2:$E$300,5,FALSE),0)","v":"DSUBGRNDLK"}]
["000000001002472049","Padlock PL330 D13","LK_PADLK","Padlock",{"$f":"IFERROR(VLOOKUP(C548,ELIST!$A$2:$E$300,2,FALSE),0)","v":"LOCKB"},{"$f":"IFERROR(VLOOKUP(C548,ELIST!$A$2:$E$300,5,FALSE),0)","v":"DSUBGRNDLK"}]
["000000001002472050","Padlock PL330 D14","LK_PADLK","Padlock",{"$f":"IFERROR(VLOOKUP(C549,ELIST!$A$2:$E$300,2,FALSE),0)","v":"LOCKB"},{"$f":"IFERROR(VLOOKUP(C549,ELIST!$A$2:$E$300,5,FALSE),0)","v":"DSUBGRNDLK"}]
["000000001002472060","Gen, LV Pillar Box","LP_PILBOX","LV Pillar Box",{"$f":"IFERROR(VLOOKUP(C550,ELIST!$A$2:$E$300,2,FALSE),0)","v":"PILLARS"},{"$f":"IFERROR(VLOOKUP(C550,ELIST!$A$2:$E$300,5,FALSE),0)","v":0}]
["000000001002472061","Gen, LV Pillar Cubicle","LP_PILCUB","LV Pillar Cubicle",{"$f":"IFERROR(VLOOKUP(C551,ELIST!$A$2:$E$300,2,FALSE),0)","v":"PILLARS"},{"$f":"IFERROR(VLOOKUP(C551,ELIST!$A$2:$E$300,5,FALSE),0)","v":0}]
["000000001002471797","Gen, Composite Fibre Pole","PL_CMPFPL","Composite Fibre Pole",{"$f":"IFERROR(VLOOKUP(C552,ELIST!$A$2:$E$300,2,FALSE),0)","v":"POLE"},{"$f":"IFERROR(VLOOKUP(C552,ELIST!$A$2:$E$300,5,FALSE),0)","v":0}]
["000000001002471802","Gen, Pole - Concrete","PL_CONPL","Concrete Pole",{"$f":"IFERROR(VLOOKUP(C553,ELIST!$A$2:$E$300,2,FALSE),0)","v":"POLE"},{"$f":"IFERROR(VLOOKUP(C553,ELIST!$A$2:$E$300,5,FALSE),0)","v":0}]
["000000001002472141","Gen, Steel Pole","PL_STLPL","Steel Pole",{"$f":"IFERROR(VLOOKUP(C554,ELIST!$A$2:$E$300,2,FALSE),0)","v":"POLE"},{"$f":"IFERROR(VLOOKUP(C554,ELIST!$A$2:$E$300,5,FALSE),0)","v":0}]
["000000001002472245","Pole - Wood Treated","PL_WOODPL","Wood Pole",{"$f":"IFERROR(VLOOKUP(C555,ELIST!$A$2:$E$300,2,FALSE),0)","v":"POLE"},{"$f":"IFERROR(VLOOKUP(C555,ELIST!$A$2:$E$300,5,FALSE),0)","v":0}]
["000000001002472246","Pole - Wood Untreated","PL_WOODPL","Wood Pole",{"$f":"IFERROR(VLOOKUP(C556,ELIST!$A$2:$E$300,2,FALSE),0)","v":"POLE"},{"$f":"IFERROR(VLOOKUP(C556,ELIST!$A$2:$E$300,5,FALSE),0)","v":0}]
["000000001002472252","Gen, Wood Pole","PL_WOODPL","Wood Pole",{"$f":"IFERROR(VLOOKUP(C557,ELIST!$A$2:$E$300,2,FALSE),0)","v":"POLE"},{"$f":"IFERROR(VLOOKUP(C557,ELIST!$A$2:$E$300,5,FALSE),0)","v":0}]
["000000001002472164","Gen, Switch Radio - PL Mount","CM_SWRAD","Switch Radio",{"$f":"IFERROR(VLOOKUP(C558,ELIST!$A$2:$E$300,2,FALSE),0)","v":"RAD"},{"$f":"IFERROR(VLOOKUP(C558,ELIST!$A$2:$E$300,5,FALSE),0)","v":0}]
["000000001002471811","Gen, SL Ctrl Pt","SL_CTRLPT","Streetlight Ctrl Pt",{"$f":"IFERROR(VLOOKUP(C559,ELIST!$A$2:$E$300,2,FALSE),0)","v":"SLCP2"},{"$f":"IFERROR(VLOOKUP(C559,ELIST!$A$2:$E$300,5,FALSE),0)","v":0}]
["000000001002471812","1PH SL Ctrl Pt","SL_CTRLPT","Streetlight Ctrl Pt",{"$f":"IFERROR(VLOOKUP(C560,ELIST!$A$2:$E$300,2,FALSE),0)","v":"SLCP2"},{"$f":"IFERROR(VLOOKUP(C560,ELIST!$A$2:$E$300,5,FALSE),0)","v":0}]
["000000001002471813","3PH SL Ctrl Pt","SL_CTRLPT","Streetlight Ctrl Pt",{"$f":"IFERROR(VLOOKUP(C561,ELIST!$A$2:$E$300,2,FALSE),0)","v":"SLCP2"},{"$f":"IFERROR(VLOOKUP(C561,ELIST!$A$2:$E$300,5,FALSE),0)","v":0}]
["000000001002471814","Timeclock Astronomic SL Ctrl Pt","SL_CTRLPT","Streetlight Ctrl Pt",{"$f":"IFERROR(VLOOKUP(C562,ELIST!$A$2:$E$300,2,FALSE),0)","v":"SLCP2"},{"$f":"IFERROR(VLOOKUP(C562,ELIST!$A$2:$E$300,5,FALSE),0)","v":0}]
["000000001002471981","Gen, Streetlight Lantern","SL_LTRNSL","Streetlight Lantern",{"$f":"IFERROR(VLOOKUP(C563,ELIST!$A$2:$E$300,2,FALSE),0)","v":"STLTR"},{"$f":"IFERROR(VLOOKUP(C563,ELIST!$A$2:$E$300,5,FALSE),0)","v":0}]
["000000001002471982","Streetlight Lantern - LED Type","SL_LTRNSL","Streetlight Lantern",{"$f":"IFERROR(VLOOKUP(C564,ELIST!$A$2:$E$300,2,FALSE),0)","v":"STLTR"},{"$f":"IFERROR(VLOOKUP(C564,ELIST!$A$2:$E$300,5,FALSE),0)","v":0}]
["000000001002471983","Streetlight Lantern - Fluro Type","SL_LTRNSL","Streetlight Lantern",{"$f":"IFERROR(VLOOKUP(C565,ELIST!$A$2:$E$300,2,FALSE),0)","v":"STLTR"},{"$f":"IFERROR(VLOOKUP(C565,ELIST!$A$2:$E$300,5,FALSE),0)","v":0}]
["000000001002471984","Streetlight Lantern - MF Type","SL_LTRNSL","Streetlight Lantern",{"$f":"IFERROR(VLOOKUP(C566,ELIST!$A$2:$E$300,2,FALSE),0)","v":"STLTR"},{"$f":"IFERROR(VLOOKUP(C566,ELIST!$A$2:$E$300,5,FALSE),0)","v":0}]
["000000001002471985","Streetlight Lantern - HPS/MH Type","SL_LTRNSL","Streetlight Lantern",{"$f":"IFERROR(VLOOKUP(C567,ELIST!$A$2:$E$300,2,FALSE),0)","v":"STLTR"},{"$f":"IFERROR(VLOOKUP(C567,ELIST!$A$2:$E$300,5,FALSE),0)","v":0}]
["000000001002471986","Streetlight Lantern - MV Type","SL_LTRNSL","Streetlight Lantern",{"$f":"IFERROR(VLOOKUP(C568,ELIST!$A$2:$E$300,2,FALSE),0)","v":"STLTR"},{"$f":"IFERROR(VLOOKUP(C568,ELIST!$A$2:$E$300,5,FALSE),0)","v":0}]
["000000001002471753","Gen, Streetlight Bracket","SL_BRKTSL","Streetlight Bracket",{"$f":"IFERROR(VLOOKUP(C569,ELIST!$A$2:$E$300,2,FALSE),0)","v":"STREETLIGHT"},{"$f":"IFERROR(VLOOKUP(C569,ELIST!$A$2:$E$300,5,FALSE),0)","v":0}]
["000000001002471754","Minor Bracket - Aluminium","SL_BRKTSL","Streetlight Bracket",{"$f":"IFERROR(VLOOKUP(C570,ELIST!$A$2:$E$300,2,FALSE),0)","v":"STREETLIGHT"},{"$f":"IFERROR(VLOOKUP(C570,ELIST!$A$2:$E$300,5,FALSE),0)","v":0}]
["000000001002471755","Major Bracket - Aluminium","SL_BRKTSL","Streetlight Bracket",{"$f":"IFERROR(VLOOKUP(C571,ELIST!$A$2:$E$300,2,FALSE),0)","v":"STREETLIGHT"},{"$f":"IFERROR(VLOOKUP(C571,ELIST!$A$2:$E$300,5,FALSE),0)","v":0}]
["000000001002471756","Minor Bracket - Steel","SL_BRKTSL","Streetlight Bracket",{"$f":"IFERROR(VLOOKUP(C572,ELIST!$A$2:$E$300,2,FALSE),0)","v":"STREETLIGHT"},{"$f":"IFERROR(VLOOKUP(C572,ELIST!$A$2:$E$300,5,FALSE),0)","v":0}]
["000000001002471757","Major Bracket - Steel","SL_BRKTSL","Streetlight Bracket",{"$f":"IFERROR(VLOOKUP(C573,ELIST!$A$2:$E$300,2,FALSE),0)","v":"STREETLIGHT"},{"$f":"IFERROR(VLOOKUP(C573,ELIST!$A$2:$E$300,5,FALSE),0)","v":0}]
["000000001002471758","Night Watch Bracket","SL_BRKTSL","Streetlight Bracket",{"$f":"IFERROR(VLOOKUP(C574,ELIST!$A$2:$E$300,2,FALSE),0)","v":"STREETLIGHT"},{"$f":"IFERROR(VLOOKUP(C574,ELIST!$A$2:$E$300,5,FALSE),0)","v":0}]
["000000001002472034","Gen, Streetlight Outreach","SL_OTRCSL","Streetlight Outreach",{"$f":"IFERROR(VLOOKUP(C575,ELIST!$A$2:$E$300,2,FALSE),0)","v":"STREETLIGHT"},{"$f":"IFERROR(VLOOKUP(C575,ELIST!$A$2:$E$300,5,FALSE),0)","v":0}]
["000000001002471761","Gen, Bus Section Unit","DG_BUSUNT","Bus Section Unit",{"$f":"IFERROR(VLOOKUP(C576,ELIST!$A$2:$E$300,2,FALSE),0)","v":"SWITCHGEAR"},{"$f":"IFERROR(VLOOKUP(C576,ELIST!$A$2:$E$300,5,FALSE),0)","v":0}]
["000000001002471763","Gen, Cable Term Unit","DG_CABTRM","Cable Term Unit",{"$f":"IFERROR(VLOOKUP(C577,ELIST!$A$2:$E$300,2,FALSE),0)","v":"SWITCHGEAR"},{"$f":"IFERROR(VLOOKUP(C577,ELIST!$A$2:$E$300,5,FALSE),0)","v":0}]
["000000001002471777","Gen, Circuit Breaker - LV","CB_CBLV","Circuit breaker - LV",{"$f":"IFERROR(VLOOKUP(C578,ELIST!$A$2:$E$300,2,FALSE),0)","v":"SWITCHGEAR"},{"$f":"IFERROR(VLOOKUP(C578,ELIST!$A$2:$E$300,5,FALSE),0)","v":0}]
["000000001002471794","Gen, Combination Swgr","DG_CMBSW","Combination Swgr",{"$f":"IFERROR(VLOOKUP(C579,ELIST!$A$2:$E$300,2,FALSE),0)","v":"SWITCHGEAR"},{"$f":"IFERROR(VLOOKUP(C579,ELIST!$A$2:$E$300,5,FALSE),0)","v":0}]
["000000001002471795","Gen, Combination Sw Stn","DG_CMBSWS","Combination Sw Stn",{"$f":"IFERROR(VLOOKUP(C580,ELIST!$A$2:$E$300,2,FALSE),0)","v":"SWITCHGEAR"},{"$f":"IFERROR(VLOOKUP(C580,ELIST!$A$2:$E$300,5,FALSE),0)","v":0}]
["000000001002471820","Gen, Direct Con - HV","DG_DCHV","Direct Con - HV",{"$f":"IFERROR(VLOOKUP(C581,ELIST!$A$2:$E$300,2,FALSE),0)","v":"SWITCHGEAR"},{"$f":"IFERROR(VLOOKUP(C581,ELIST!$A$2:$E$300,5,FALSE),0)","v":0}]
["000000001002471914","Gen, HV Busbar","DG_HVBUSB","HV Busbar",{"$f":"IFERROR(VLOOKUP(C582,ELIST!$A$2:$E$300,2,FALSE),0)","v":"SWITCHGEAR"},{"$f":"IFERROR(VLOOKUP(C582,ELIST!$A$2:$E$300,5,FALSE),0)","v":0}]
["000000001002471992","Gen, LV Busbar","DG_LVBUSB","LV Busbar",{"$f":"IFERROR(VLOOKUP(C583,ELIST!$A$2:$E$300,2,FALSE),0)","v":"SWITCHGEAR"},{"$f":"IFERROR(VLOOKUP(C583,ELIST!$A$2:$E$300,5,FALSE),0)","v":0}]
["000000001002471735","Gen, Auto Transformer","TX_AUTOTX","Auto Transformer",{"$f":"IFERROR(VLOOKUP(C584,ELIST!$A$2:$E$300,2,FALSE),0)","v":"TRANSFORMER"},{"$f":"IFERROR(VLOOKUP(C584,ELIST!$A$2:$E$300,5,FALSE),0)","v":0}]
["000000001002471762","Gen, Cable Entry Trf","TX_CABETX","Cable Entry Trf",{"$f":"IFERROR(VLOOKUP(C585,ELIST!$A$2:$E$300,2,FALSE),0)","v":"TRANSFORMER"},{"$f":"IFERROR(VLOOKUP(C585,ELIST!$A$2:$E$300,5,FALSE),0)","v":0}]
["000000001002471890","Gen, Free Standing Trf","TX_FSTDTX","Free Standing Trf",{"$f":"IFERROR(VLOOKUP(C586,ELIST!$A$2:$E$300,2,FALSE),0)","v":"TRANSFORMER"},{"$f":"IFERROR(VLOOKUP(C586,ELIST!$A$2:$E$300,5,FALSE),0)","v":0}]
["000000001002471896","Gen, Ground Mounted Trf","TX_GDMTTX","Ground Mounted Trf",{"$f":"IFERROR(VLOOKUP(C587,ELIST!$A$2:$E$300,2,FALSE),0)","v":"TRANSFORMER"},{"$f":"IFERROR(VLOOKUP(C587,ELIST!$A$2:$E$300,5,FALSE),0)","v":0}]
["000000001002471950","Gen, Kiosk Transformer","TX_KSKTX","Kiosk Transformer",{"$f":"IFERROR(VLOOKUP(C588,ELIST!$A$2:$E$300,2,FALSE),0)","v":"TRANSFORMER"},{"$f":"IFERROR(VLOOKUP(C588,ELIST!$A$2:$E$300,5,FALSE),0)","v":0}]
["000000001002472051","Gen, Padmount Transformer","TX_PADTX","Padmount Transformer",{"$f":"IFERROR(VLOOKUP(C589,ELIST!$A$2:$E$300,2,FALSE),0)","v":"TRANSFORMER"},{"$f":"IFERROR(VLOOKUP(C589,ELIST!$A$2:$E$300,5,FALSE),0)","v":0}]
["000000001002472065","Crossarm Mounted Trf","TX_PLMTTX","Pole Mounted Trf",{"$f":"IFERROR(VLOOKUP(C590,ELIST!$A$2:$E$300,2,FALSE),0)","v":"TRANSFORMER"},{"$f":"IFERROR(VLOOKUP(C590,ELIST!$A$2:$E$300,5,FALSE),0)","v":0}]
["000000001002472066","Gen, PL Mounted Trf","TX_PLMTTX","Pole Mounted Trf",{"$f":"IFERROR(VLOOKUP(C591,ELIST!$A$2:$E$300,2,FALSE),0)","v":"TRANSFORMER"},{"$f":"IFERROR(VLOOKUP(C591,ELIST!$A$2:$E$300,5,FALSE),0)","v":0}]
["000000001002472239","Gen, Voltage Reg Trf","TX_VREGTX","Voltage Reg Trf",{"$f":"IFERROR(VLOOKUP(C592,ELIST!$A$2:$E$300,2,FALSE),0)","v":"TRANSFORMER"},{"$f":"IFERROR(VLOOKUP(C592,ELIST!$A$2:$E$300,5,FALSE),0)","v":0}]
["000000001002476269","Gen, PL Mounted Trf","TX_PLMTTX","Pole Mounted Trf",{"$f":"IFERROR(VLOOKUP(C593,ELIST!$A$2:$E$300,2,FALSE),0)","v":"TRANSFORMER"},{"$f":"IFERROR(VLOOKUP(C593,ELIST!$A$2:$E$300,5,FALSE),0)","v":0}]
["000000001002472240","Gen, VT - Switch","VT_VTSW","VT Switch",{"$f":"IFERROR(VLOOKUP(C594,ELIST!$A$2:$E$300,2,FALSE),0)","v":"VT"},{"$f":"IFERROR(VLOOKUP(C594,ELIST!$A$2:$E$300,5,FALSE),0)","v":0}]

{"sheet":"FLCONTYPE","index":8,"n_rows":139,"n_cols":5,"rows_kept":139,"cut":false,"hidden":true,"merged":[]}
["Reference Functional Location","FL's Construction Type","FL's Construction Type Desc","FL's Technical Object Type","FL's Technical Object Type Desc"]
["ASSMCLMN0001","000000005000000632","Gen, UG Termination","GD_UGTERM","UG Termination"]
["ASSMCLMN0001","000000005000000634","Termination UG - LV Mains Bolted","GD_UGTERM","UG Termination"]
["ASSMCLMN0001","000000005000000635","Termination UG LV Mains- Panel","GD_UGTERM","UG Termination"]
["ASSMCLMN0001","000000005000000636","Termination UG - LV Service Mains","GD_UGTERM","UG Termination"]
["ASSMCLMN0001","000000005000000637","Termination UG - SL Mains","GD_UGTERM","UG Termination"]
["ASSMPILL0001","000000005000000632","Gen, UG Termination","GD_UGTERM","UG Termination"]
["ASSMPILL0001","000000005000000634","Termination UG - LV Mains Bolted","GD_UGTERM","UG Termination"]
["ASSMPILL0001","000000005000000635","Termination UG LV Mains- Panel","GD_UGTERM","UG Termination"]
["ASSMPILL0001","000000005000000636","Termination UG - LV Service Mains","GD_UGTERM","UG Termination"]
["ASSMPILL0001","000000005000000637","Termination UG - SL Mains","GD_UGTERM","UG Termination"]
["ASSMPOLE0001","000000005000000628","Gen, UG/OH Termination","OH_UGOH","UG/OH Termination"]
["ASSMPOLE0001","000000005000000593","Transmission OH Assembly - Non Crossarm","OH_TRASSM","TR Overhead Assembly"]
["ASSMPOLE0001","000000005000000592","Transmission OH Assembly - Crossarm","OH_TRASSM","TR Overhead Assembly"]
["ASSMPOLE0001","000000005000000591","Gen, TR Overhead Assembly","OH_TRASSM","TR Overhead Assembly"]
["ASSMPOLE0001","000000005000000398","Gen, Pilot Cable","OH_PILOT","Pilot Cable"]
["ASSMPOLE0001","000000005000000354","Gen, OPGW","OH_OPGW","OPGW"]
["ASSMPOLE0001","000000005000000292","LV OH Assembly - Xarm Type - Bare","OH_LVASSM","LV Overhead Assembly"]
["ASSMPOLE0001","000000005000000291","LV OH Assembly - Non Xarm - Bare","OH_LVASSM","LV Overhead Assembly"]
["ASSMPOLE0001","000000005000000290","LV OH Assembly - Xarm Type - ABC","OH_LVASSM","LV Overhead Assembly"]
["ASSMPOLE0001","000000005000000288","LV OH Assembly - Non Xarm - ABC","OH_LVASSM","LV Overhead Assembly"]
["ASSMPOLE0001","000000005000000287","Gen, LV Overhead Assembly","OH_LVASSM","LV Overhead Assembly"]
["ASSMPOLE0001","000000005000000186","HV OH Assembly - Crossarm Type - CCT","OH_HVASSM","HV Overhead Assembly"]
["ASSMPOLE0001","000000005000000185","HV OH Assembly - Non Crossarm - CCT","OH_HVASSM","HV Overhead Assembly"]
["ASSMPOLE0001","000000005000000184","HV OH Assembly - Crossarm Type - Bare","OH_HVASSM","HV Overhead Assembly"]
["ASSMPOLE0001","000000005000000183","HV OH Assembly - Non Crossarm - Bare","OH_HVASSM","HV Overhead Assembly"]
["ASSMPOLE0001","000000005000000182","HV OH Assembly - Crossarm Type - ABC","OH_HVASSM","HV Overhead Assembly"]
["ASSMPOLE0001","000000005000000181","HV OH Assembly - Non Crossarm - ABC","OH_HVASSM","HV Overhead Assembly"]
["ASSMPOLE0001","000000005000000180","Gen, HV Overhead Assembly","OH_HVASSM","HV Overhead Assembly"]
["ASSMPOLE0001","000000005000000106","Gen, Earth Wire","OH_EWIRE","Earth Wire Assembly"]
["BBHVDSUB0001","000000005000000187","Gen, HV Busbar","DG_HVBUSB","HV Busbar"]
["BBLVDSUB0001","000000005000000293","Gen, LV Busbar","DG_LVBUSB","LV Busbar"]
["BBLVPOLE0001","000000005000000293","Gen, LV Busbar","DG_LVBUSB","LV Busbar"]
["CLMNCLMN0001","000000005000000007","Gen, Structure Column","ST_CLMNST","Structure Column"]
["DSSWDSUB0001","000000005000000098","Gen, Earth Switch - Dist","DG_ERSWD","Dist Earth Switch"]
["DSSWDSUB0001","000000005000000546","Gen, HV Switch/Fuse Unit","DG_SWFUNT","HV Switch/Fuse Unit"]
["DSSWDSUB0001","000000005000000547","HV Switch/Fuse Unit - Epoxy Encapsulated","DG_SWFUNT","HV Switch/Fuse Unit"]
["DSSWDSUB0001","000000005000000548","HV Switch/Fuse Unit - Sheet Steel Enclos","DG_SWFUNT","HV Switch/Fuse Unit"]
["DSSWDSUB0002","000000005000000225","Gen, Isol/Disc - LV - GD","DG_ISLVGD","Isol/Disc - LV - GD"]
["DSSWDSUB0002","000000005000000226","Gen, Isol No Load Br - LV","DG_ISNLLV","Isol No Load Br - LV"]
["DSSWPOLE0001","000000005000000756","Gen, LV Circuit Breaker - Pole Mounted","CB_CBLVPL","CB - LV - PL"]
["DSSWPOLE0001","000000005000000270","Gen, Link/Fuse Pole Mount","SW_LINKF","Link/Fuse"]
["DSSWPOLE0001","000000005000000074","Drop Out Fuse - Other (Sub)","SW_DOFSUB","Drop Out Fuse PL Sub"]
["DSSWPOLE0001","000000005000000073","Drop Out Fuse (Wired) - Porcelain (Sub)","SW_DOFSUB","Drop Out Fuse PL Sub"]
["DSSWPOLE0001","000000005000000072","Drop Out Fuse (Wired) - Polymeric (Sub)","SW_DOFSUB","Drop Out Fuse PL Sub"]
["DSSWPOLE0001","000000005000000071","Drop Out Fuse (Boric) - Porcelain (Sub)","SW_DOFSUB","Drop Out Fuse PL Sub"]
["DSSWPOLE0001","000000005000000070","Gen, Drop Out Fuse PL Sub","SW_DOFSUB","Drop Out Fuse PL Sub"]
["DSSWPOLE0001","000000005000000053","LV Direct Connection - Pole Substation","DG_DCLVPL","Direct Con - LV - PL"]
["DSSWPOLE0001","000000005000000052","Gen, Direct Con - LV - PL","DG_DCLVPL","Direct Con - LV - PL"]
["DSTXDSUB0001","000000005000000152","Gen, Free Standing Trf","TX_FSTDTX","Free Standing Trf"]
["DSTXDSUB0001","000000005000000162","Gen, Ground Mounted Trf","TX_GDMTTX","Ground Mounted Trf"]
["DSTXDSUB0001","000000005000000234","Gen, Auto Transformer","TX_AUTOTX","Auto Transformer"]
["DSTXDSUB0001","000000005000000243","Gen, Kiosk Transformer","TX_KSKTX","Kiosk Transformer"]
["DSTXDSUB0001","000000005000000384","Gen, Padmount Transformer","TX_PADTX","Padmount Transformer"]
["DSTXDSUB0001","000000005000000403","Gen, Platform Transformer","TX_PLFMTX","Platform Transformer"]
["DSTXDSUB0001","000000005000000633","Gen, Cable Entry Trf","TX_CABETX","Cable Entry Trf"]
["DSTXDSUB0001","000000005000000664","Gen, Voltage Reg Trf","TX_VREGTX","Voltage Reg Trf"]
["DSTXPOLE0001","000000005000000664","Gen, Voltage Reg Trf","TX_VREGTX","Voltage Reg Trf"]
["DSTXPOLE0001","000000005000000404","Crossarm Mounted Trf","TX_PLMTTX","Pole Mounted Trf"]
["DSTXPOLE0001","000000005000000405","Gen, PL Mounted Trf","TX_PLMTTX","Pole Mounted Trf"]
["DSUBDSUB0001","000000005000000383","Gen, Padmount Substation","DS_PADSUB","Padmount Substation"]
["DSUBDSUB0001","000000005000000476","Gen, Regulating Sub - GD","DS_REGSUB","Regulating Sub - GD"]
["DSUBDSUB0001","000000005000000242","Gen, Kiosk Substation","DS_KSKSUB","Kiosk Substation"]
["DSUBDSUB0001","000000005000000205","Gen, Indoor Swtchng Stn","DS_INDSW","Indoor Swtchng Stn"]
["DSUBDSUB0001","000000005000000204","Gen, Indoor Substation","DS_INDSUB","Indoor Substation"]
["DSUBDSUB0001","000000005000000190","Gen, Private Sub/HVC","DS_HVCSUB","Private Sub/HVC"]
["DSUBDSUB0001","000000005000000166","Gen, Ground Substation","DS_GNDSUB","Ground Substation"]
["DSUBDSUB0001","000000005000000040","Gen, Cubicle Swtchng Stn","DS_CUBSW","Cubicle Swtchng Stn"]
["DSUBDSUB0001","000000005000000026","Gen, Cottage Substation","DS_COTSUB","Cottage Substation"]
["DSUBPOLE0001","000000005000000190","Gen, Private Sub/HVC","DS_HVCSUB","Private Sub/HVC"]
["DSUBPOLE0001","000000005000000406","Gen, Single Pole Sub","DS_PLSUB","Single Pole Sub"]
["DSUBPOLE0001","000000005000000407","Single Pole Substation - Coastal Type","DS_PLSUB","Single Pole Sub"]
["DSUBPOLE0001","000000005000000408","Single Pole Substation - Urban Type","DS_PLSUB","Single Pole Sub"]
["DSUBPOLE0001","000000005000000409","Single Pole Substation - Rural/Semi Type","DS_PLSUB","Single Pole Sub"]
["DSUBPOLE0001","000000005000000484","Gen, Regulating Pole Sub","DS_RPLSUB","Regulating Pole Sub"]
["DSUBPOLE0001","000000005000000485","Overhead Voltage Regulator - 3PH","DS_RPLSUB","Regulating Pole Sub"]
["DSUBPOLE0001","000000005000000541","Gen, SWER Isolating Sub","DS_SWERIS","SWER Isolating Sub"]
["DSUBPOLE0001","000000005000000542","Gen, SWER Substation","DS_SWERSB","SWER Substation"]
["HVCBDSUB0001","000000005000000754","Gen, Circuit Breaker - HV","CB_CBHV","Circuit breaker - HV"]
["HVDGDSUB0001","000000005000000644","Gen, Cable Term Unit","DG_CABTRM","Cable Term Unit"]
["HVDGDSUB0001","000000005000000622","Gen, Bus Section Unit","DG_BUSUNT","Bus Section Unit"]
["HVDGDSUB0001","000000005000000050","Gen, Direct Con - HV","DG_DCHV","Direct Con - HV"]
["HVDGDSUB0001","000000005000000013","Gen, Combination Sw Stn","DG_CMBSWS","Combination Sw Stn"]
["HVDGDSUB0001","000000005000000011","Gen, Combination Swgr","DG_CMBSW","Combination Swgr"]
["LVCBDSUB0001","000000005000000755","Gen, Circuit Breaker - LV","CB_CBLV","Circuit breaker - LV"]
["LVDGDSUB0001","000000005000000299","Gen, LV Switchgear","DG_LVSWGR","LV Switchgear"]
["PILLPILL0001","000000005000000397","Gen, Structure LV Pillar","ST_PILLST","Structure LV Pillar"]
["POLEPOLE0001","000000005000000416","Gen, Structure Pole","ST_POLEST","Structure Pole"]
["POLEPOLE0001","000000005000000417","Pole Structure - Distribution Use","ST_POLEST","Structure Pole"]
["POLEPOLE0001","000000005000000418","Pole Structure - Streetlighting Use","ST_POLEST","Structure Pole"]
["POLEPOLE0001","000000005000000419","Pole Structure - Transmission Use","ST_POLEST","Structure Pole"]
["POLEPOLE0001","000000005000000420","Pole Structure - Extended Service Use","ST_POLEST","Structure Pole"]
["SLCPCLMN0001","000000005000000036","Gen, Streetlight Ctrl Pt","SL_CTRLPT","Streetlight Ctrl Pt"]
["SLCPCLMN0001","000000005000000037","1PH SL Control Point","SL_CTRLPT","Streetlight Ctrl Pt"]
["SLCPCLMN0001","000000005000000038","3PH SL Control Point","SL_CTRLPT","Streetlight Ctrl Pt"]
["SLCPCLMN0001","000000005000000039","Timeclock Astronomic SL Control Point","SL_CTRLPT","Streetlight Ctrl Pt"]
["SLCPPOLE0001","000000005000000039","Timeclock Astronomic SL Control Point","SL_CTRLPT","Streetlight Ctrl Pt"]
["SLCPPOLE0001","000000005000000036","Gen, Streetlight Ctrl Pt","SL_CTRLPT","Streetlight Ctrl Pt"]
["SLCPPOLE0001","000000005000000037","1PH SL Control Point","SL_CTRLPT","Streetlight Ctrl Pt"]
["SLCPPOLE0001","000000005000000038","3PH SL Control Point","SL_CTRLPT","Streetlight Ctrl Pt"]
["SLGTCLMN0001","000000005000000521","Gen, Street Lighting","SL_STLGHT","Street Lighting"]
["SLGTPOLE0001","000000005000000521","Gen, Street Lighting","SL_STLGHT","Street Lighting"]
["SWITCLMN0001","000000005000000294","Gen, LV Links","SW_LVLINK","LV Links"]
["SWITCLMN0001","000000005000000295","LV Double Switch Panel - Column","SW_LVLINK","LV Links"]
["SWITCLMN0001","000000005000000296","LV Single Switch Panel - Column","SW_LVLINK","LV Links"]
["SWITDSUB0001","000000005000000098","Gen, Earth Switch - Dist","DG_ERSWD","Dist Earth Switch"]
["SWITDSUB0001","000000005000000553","Gen, HV Switch Unit","DG_SWUNT","HV Switch Unit"]
["SWITDSUB0001","000000005000000554","HV Switch Unit - Epoxy Encapsulated","DG_SWUNT","HV Switch Unit"]
["SWITDSUB0001","000000005000000557","HV Switch Unit - Sheet Steel Encloed","DG_SWUNT","HV Switch Unit"]
["SWITDSUB0002","000000005000000051","Gen, Direct Con - LV - GD","DG_DCLVGD","Direct Con - LV - GD"]
["SWITDSUB0002","000000005000000164","Gen, Generator Link - LV","DG_GENLK","Generator Link - LV"]
["SWITDSUB0002","000000005000000241","Gen, Knife Switch - LV","DG_KNFLV","Knife Switch - LV"]
["SWITDSUB0002","000000005000000517","Gen, Steel Encl Swbd - LV","DG_SSWBLV","Steel Encl Swbd - LV"]
["SWITDSUB0002","000000005000000543","Gen, Switch Fuse - LV","DG_SWFSLV","Switch Fuse - LV"]
["SWITDSUB0002","000000005000000550","Gen, SW Load Break - LV","DG_SWLBLV","Sw Load Break - LV"]
["SWITPILL0001","000000005000000684","LV Link Box - Fuse","SW_LVLKBX","LV Link Box"]
["SWITPILL0001","000000005000000683","LV Link Box - Removeable Link","SW_LVLKBX","LV Link Box"]
["SWITPILL0001","000000005000000682","LV Link Box - Solid","SW_LVLKBX","LV Link Box"]
["SWITPILL0001","000000005000000297","Gen, LV Link Box","SW_LVLKBX","LV Link Box"]
["SWITPILL0001","000000005000000543","Gen, Switch Fuse - LV","DG_SWFSLV","Switch Fuse - LV"]
["SWITPILL0001","000000005000000294","Gen, LV Links","SW_LVLINK","LV Links"]
["SWITPOLE0001","000000005000000270","Gen, Link/Fuse Pole Mount","SW_LINKF","Link/Fuse"]
["SWITPOLE0001","000000005000000012","Air Break Switch - Distribution","SW_ABS","Air Break Switch"]
["SWITPOLE0001","000000005000000023","Air Break Switch - Transmission","SW_ABS","Air Break Switch"]
["SWITPOLE0001","000000005000000065","Drop Out Fuse (Boric) - Porcelain","SW_DOFPL","Drop Out Fuse Pole"]
["SWITPOLE0001","000000005000000066","Drop Out Fuse (Wired) - Polymeric","SW_DOFPL","Drop Out Fuse Pole"]
["SWITPOLE0001","000000005000000068","Drop Out Fuse (Wired) - Porcelain","SW_DOFPL","Drop Out Fuse Pole"]
["SWITPOLE0001","000000005000000069","Drop Out Fuse - Other","SW_DOFPL","Drop Out Fuse Pole"]
["SWITPOLE0001","000000005000000155","Gen, Fuse Saver","SW_FUSAVR","Fuse Saver"]
["SWITPOLE0001","000000005000000249","Gen, Load Break Switch","SW_LBS","Load Break Switch"]
["SWITPOLE0001","000000005000000250","Load Break Switch - Pole - Manual Oper","SW_LBS","Load Break Switch"]
["SWITPOLE0001","000000005000000251","Load Break Switch - Pole - Auto Oper","SW_LBS","Load Break Switch"]
["SWITPOLE0001","000000005000000268","Gen, Link","SW_LINK","Link"]
["SWITPOLE0001","000000005000000269","Links - Pole Mounted","SW_LINK","Link"]
["SWITPOLE0001","000000005000000473","Gen, Recloser","SW_RECL","Recloser"]
["SWITPOLE0001","000000005000000497","Gen, Sectionaliser","SW_SECT","Sectionaliser"]
["SWITPOLE0001","000000005000000640","Gen, Under Slung Link","SW_USL","Under Slung Link"]
["SWITPOLE0001","000000005000000641","HV Underslung Links - PL Mount-Polymeric","SW_USL","Under Slung Link"]
["SWITPOLE0001","000000005000000642","HV Underslung Links - PL Mount-Porcelain","SW_USL","Under Slung Link"]

{"sheet":"ELIST","index":9,"n_rows":74,"n_cols":5,"rows_kept":74,"cut":false,"hidden":true,"merged":[]}
["Code","Range","Role","Value"]
["OH_UGOH","ASSM",null,"UG/OH Termination"]
["OH_TRASSM","ASSM",null,"TR Overhead Assembly"]
["OH_HVASSM","ASSM",null,"HV Overhead Assembly"]
["OH_LVASSM","ASSM",null,"LV Overhead Assembly"]
["OH_PCTE","ASSM",null,"Pilot Termination"]
["OH_PILOT","ASSM",null,"Pilot Cable"]
["OH_EWIRE","ASSM",null,"Earth Wire"]
["OH_OPGW","ASSM",null,"OPGW"]
["GD_UGTERM","ASSM",null,"UG Termination"]
["CL_CNSLCL","COLUMN",null,"Column Concrete (SL)"]
["CL_STLVCL","COLUMN",null,"Column Steel (LV)"]
["CL_STSLCL","COLUMN",null,"Column Steel (SL)"]
["CV_BRKENC","DSUBGRNDBEN",null,"Brick Enclosure"]
["CV_CMPCUB","DSUBGRNDCMCU",null,"Composite Cubicle"]
["LK_CYLNLK","LOCKA",null,"Cylinder Lock","DSUBGRNDLK"]
["FE_EMEXLT","DSUBGRNDEME",null,"Emergency Exit Light"]
["FE_FBLDRY","DSUBGRNDFBD",null,"Fire Blankets - Dry"]
["FE_FEXTGH","DSUBGRNDFEX",null,"Fire Extinguisher"]
["CV_DRSTD","DSUBGRNDRSTD",null,"Door - Standard"]
["SE_SRGDIV","DSUBPOLESRG",null,"Surge Diverters"]
["SW_ABS","HVSWITCHES",null,"Air Break Switch"]
["SW_LBS","HVSWITCHES",null,"Load Break Switch"]
["SW_SECT","HVSWITCHES",null,"Sectionaliser"]
["SW_RECL","HVSWITCHES",null,"Recloser"]
["SW_DOFPL","HVSWITCHES",null,"Drop Out Fuse Pole"]
["SW_FUSAVR","HVSWITCHES",null,"Fuse Saver"]
["SW_USL","HVSWITCHES",null,"Under Slung Link"]
["SW_LINK","HVSWITCHES",null,"Link"]
["DG_SWFSPL","HVSWITCHES",null,"Sw Fuse - LV - PL"]
["SW_LVLINK","HVSWITCHES",null,"LV Links"]
["DG_SWFSLV","HVSWITCHES",null,"Switch Fuse - LV"]
["SW_DOFSUB","HVSWITCHES",null,"Drop Out Fuse PL Sub"]
["SW_LINKF","HVSWITCHES",null,"Link/Fuse"]
["CB_CBLVPL","HVSWITCHES",null,"CB - LV - PL"]
["DG_DCLVPL","HVSWITCHES",null,"Direct Con - LV - PL"]
["DG_ISNLLV","HVSWITCHES",null,"Isol No Load Br - LV"]
["DG_ISLVGD","HVSWITCHES",null,"Isol/Disc - LV - GD"]
["DG_SWLBLV","HVSWITCHES",null,"Sw Load Break - LV"]
["DG_DCLVGD","HVSWITCHES",null,"Direct Con - LV - GD"]
["DG_SSWBLV","HVSWITCHES",null,"Steel Encl Swbd - LV"]
["DG_KNFLV","HVSWITCHES",null,"Knife Switch - LV"]
["DG_GENLK","HVSWITCHES",null,"Generator Link - LV"]
["CM_SWCTRL","CTRL",null,"Switch Controller"]
["LK_PADLK","LOCKB",null,"Padlock","DSUBGRNDLK"]
["CM_SWRAD","RAD",null,"Switch Radio"]
["VT_VTSW","VT",null,"VT - Switch"]
["LP_PILBOX","PILLARS",null,"LV Pillar Box"]
["LP_PILCUB","PILLARS",null,"LV Pillar Cubicle"]
["PL_CONPL","POLE",null,"Gen, Concrete Pole"]
["PL_WOODPL","POLE",null,"Wood Pole Treated"]
["PL_CMPFPL","POLE",null,"Composite Fibre Pole"]
["PL_STLPL","POLE",null,"Steel Pole"]
["SL_CTRLPT","SLCP2",null,"Streetlight Ctrl Pt"]
["SL_OTRCSL","STREETLIGHT",null,"Streetlight Outreach"]
["SL_BRKTSL","STREETLIGHT",null,"Streetlight Bracket"]
["SL_LTRNSL","STLTR",null,"Streetlight Lantern"]
["DG_CMBSW","SWITCHGEAR",null,"Combination Swgr"]
["DG_CMBSWS","SWITCHGEAR",null,"Combination Sw Stn"]
["DG_CABTRM","SWITCHGEAR",null,"Cable Term Unit"]
["DG_BUSUNT","SWITCHGEAR",null,"Bus Section Unit"]
["DG_DCHV","SWITCHGEAR",null,"Direct Con - HV"]
["CB_CBHV","SWITCHGEAR",null,"Circuit breaker - HV"]
["CB_CBLV","SWITCHGEAR",null,"Circuit breaker - LV"]
["DG_LVBUSB","SWITCHGEAR",null,"LV Busbar"]
["DG_HVBUSB","SWITCHGEAR",null,"HV Busbar"]
["TX_AUTOTX","TRANSFORMER",null,"Auto Transformer"]
["TX_GDMTTX","TRANSFORMER",null,"Ground Mounted Trf"]
["TX_KSKTX","TRANSFORMER",null,"Kiosk Transformer"]
["TX_CABETX","TRANSFORMER",null,"Cable Entry Trf"]
["TX_FSTDTX","TRANSFORMER",null,"Free Standing Trf"]
["TX_PLMTTX","TRANSFORMER",null,"Pole Mounted Trf"]
["TX_VREGTX","TRANSFORMER",null,"Voltage Reg Trf"]
["TX_PADTX","TRANSFORMER",null,"Padmount Transformer"]

{"sheet":"Tarrif_Config","index":10,"n_rows":109,"n_cols":72,"rows_kept":109,"cut":false,"hidden":true,"merged":[]}
["TariffClass","Code","Luminaire","Code","EQUIP","_TC1","_TC2","_TC3","_TC4","_TC5","_TC6",null,"Range","Role","Value","Code",null,"Luminaire","Code","_TC1","_TC2","_TC3","_TC4","_TC5","_TC6","EQUIP",null,"Range","Role","Value","Code",null,null,"HorizontalSupport","Code","Rates","_TC1","_TC2","_TC3","_TC4","_TC5","_TC6",null,"HorizontalSupport","Code","Rates","_TC1","_TC2","_TC3","_TC4","_TC5","_TC6",null,"VerticalSupport","Code","Rates","_TC1","_TC2","_TC3","_TC4","_TC5","_TC6",null,"VerticalSupport","Code","Rates","_TC1","_TC2","_TC3","_TC4","_TC5","_TC6"]
["+STC,,,,Y",null,"+SLU,,,,",null,null,null,null,null,null,null,null,null,"SL_TARIFF_CLASS","Value","(1) Legacy, Constructed by EE","1",null,"+SLU,,,,",null,null,null,null,null,null,null,null,null,"HORIZ_SUPPORT_TARIFF","Value","Leg -Owned, const, maint by EE","1",null,null,"+SHS,,,,",null,null,null,null,null,null,null,null,null,"+SHS,,,,",null,null,null,null,null,null,null,null,null,"+SVS,,,,",null,null,null,null,null,null,null,null,null,"+SVS,,,,"]
["(1) Legacy, Constructed by EE",1,"42W CFL - AEROSCREEN","CF42AS",{"$f":"IFERROR(VLOOKUP($D3,$S$1:$Z$81,MATCH(E$1,$S$1:$Z$1,0),FALSE),0)","v":"Streetlight Lantern - Fluro Type"},{"$f":"IFERROR(VLOOKUP($D3,$S$1:$Z$81,MATCH(F$1,$S$1:$Z$1,0),FALSE),0)","v":0},0,578,878,0,746,null,"SL_TARIFF_CLASS","Value","(2) Legacy, Gift by Customer","2",null,"9W LED STREETLED Aeroscreen S-S","L009SA",0,0,434,758,0,0,"Streetlight Lantern - LED Type",null,"HORIZ_SUPPORT_TARIFF","Value","Leg -Gift by cust, maint by EE","2",null,null,"Bracket - Major (>3M)","BRMA",null,{"$f":"IFERROR(VLOOKUP($AH3,$AR$1:$AZ$13,MATCH(AK$1,$AR$1:$AZ$1,0),FALSE),0)","v":0},{"$f":"IFERROR(VLOOKUP($AH3,$AR$1:$AZ$13,MATCH(AL$1,$AR$1:$AZ$1,0),FALSE),0)","v":0},591,891,0,793,null,"Bracket - Major (>3M)","BRMA",591891793,0,0,591,891,0,793,null,"Column (Al) - Major (>9M)","CAMA",null,{"$f":"IFERROR(VLOOKUP($BC3,$BM$1:$BT$15,MATCH(BE$1,$BM$1:$BT$1,0),FALSE),0)","v":0},{"$f":"IFERROR(VLOOKUP($BC3,$BM$1:$BT$15,MATCH(BF$1,$BM$1:$BT$1,0),FALSE),0)","v":0},0,0,0,0,null,"Column (Steel) - Major (>9M)","CSMA",696996796,0,0,696,996,0,796]
["(2) Legacy, Gift by Customer",2,"42W CFL - BOURKE HILL","CF42BH",{"$f":"IFERROR(VLOOKUP($D4,$S$1:$Z$81,MATCH(E$1,$S$1:$Z$1,0),FALSE),0)","v":"Streetlight Lantern - Fluro Type"},0,0,583,883,0,751,null,"SL_TARIFF_CLASS","Value","(3) Annuity, Constructed by EE","3",null,"13W LED ATS PLED MKII","L013AP",0,0,456,780,0,0,"Streetlight Lantern - LED Type",null,"HORIZ_SUPPORT_TARIFF","Value","Annuity-Own, Const Maint By EE","3",null,null,"Bracket - Minor (<3M)","BRMI",null,{"$f":"IFERROR(VLOOKUP($AH4,$AR$1:$AZ$13,MATCH(AK$1,$AR$1:$AZ$1,0),FALSE),0)","v":0},0,590,890,0,792,null,"Bracket - Minor (<3M)","BRMI",590890792,0,0,590,890,0,792,null,"Column (Al) - Minor (<=9M)","CAMI",null,{"$f":"IFERROR(VLOOKUP($BC4,$BM$1:$BT$15,MATCH(BE$1,$BM$1:$BT$1,0),FALSE),0)","v":0},0,0,0,0,0,null,"Column (Steel) - Minor (<9M)","CSMI",695995795,0,0,695,995,0,795]
["(3) Annuity, Constructed by EE",3,"42W CFL - POST TOP","CF42PT","Streetlight Lantern - Fluro Type",0,0,580,880,0,748,null,"SL_TARIFF_CLASS","Value","(4) Annuity, Gift by Customer","4",null,"13W LED StreetLED3 STD Visor S-S","L013SS",0,0,433,757,0,0,"Streetlight Lantern - LED Type",null,"HORIZ_SUPPORT_TARIFF","Value","Annuity-Gift By Cus, Mnt By EE","4",null,null,"Legacy - Major Bracket (>3M)","LBRMA",null,0,0,0,0,0,0,null,"Legacy - Major Bracket (>3M)","LBRMA",225428,0,0,0,0,0,0,null,"Column (Steel) - Major (>9M)","CSMA",null,0,0,696,996,0,796,null,"Legacy - Major Column (>9M)","LCSMA",229426,229,426,0,0,0,0]
["(4) Annuity, Gift by Customer",4,"42W CFL - STANDARD","CF42ST","Streetlight Lantern - Fluro Type",0,0,553,853,0,718,null,"SL_TARIFF_CLASS","Value","(6) Owned by Customer","6",null,"17W LED Post Top B2001 S-S","L017PS",0,0,435,759,0,0,"Streetlight Lantern - LED Type",null,"HORIZ_SUPPORT_TARIFF","Value","Owned By Cust & Maint By EE","6",null,null,"Legacy - Minor Bracket (<3M)","LBRMI",null,0,0,0,0,0,0,null,"Legacy - Minor Bracket (<3M)","LBRMI",224427,0,0,0,0,0,0,null,"Column (Steel) - Minor (<9M)","CSMI",null,0,0,695,995,0,795,null,"Legacy - Minor Column (<9M)","LCSMI",228425,228,425,0,0,0,0]
["(6) Owned by Customer",6,"100W Sodium - AEROSCREEN","HP10AS","Streetlight Lantern - HPS/MH Type",0,0,579,879,0,747,null,null,null,null,null,null,"17W LED B2001 NUWE Post Top","L017PT",0,0,665,965,0,0,"Streetlight Lantern - LED Type",null,null,null,null,null,null,null,"Legacy - Major Outreach (>2M)","LOTMA",null,0,0,0,0,0,0,null,"Legacy - Major Outreach (>2M)","LOTMA",227424,0,0,0,0,0,0,null,"Legacy - Major Column (>9M)","LCSMA",null,229,426,0,0,0,0,null,"Legacy - Urd Min Column (<9M)","LUCSMI",231,231,0,0,0,0,0]
[null,null,"150W Sodium - FLOODLIGHT","HP15FL","Streetlight Lantern - HPS/MH Type",0,0,581,881,0,749,null,null,null,null,null,null,"17W LED STREETLED3 Aeroscreen S-S","L017SA",0,0,432,756,0,0,"Streetlight Lantern - LED Type",null,null,null,null,null,null,null,"Legacy - Minor Outreach (<2M)","LOTMI",null,0,0,0,0,0,0,null,"Legacy - Minor Outreach (<2M)","LOTMI",226423,0,0,0,0,0,0,null,"Legacy - Minor Column (<9M)","LCSMI",null,228,425,0,0,0,0,null,"Legacy - Maj Wood Pole (>11M)","LWPMA",233430,233,430,0,0,0,0]
[null,null,"250W Sodium - PARKVILLE","HP25PV","Streetlight Lantern - HPS/MH Type",0,0,584,884,0,752,null,null,null,null,null,null,"17W LED Cat P Luminaire","L017ST",0,0,589,889,0,704,"Streetlight Lantern - LED Type",null,null,null,null,null,null,null,"Legacy - Urd Min Outrch (>2M)","LUOTMI",null,0,0,0,0,0,0,null,"Legacy - URD Minor Outreach (<2M)","LUOTMI",230,0,0,0,0,0,0,null,"Legacy - Urd Min Column (<9M)","LUCSMI",null,231,0,0,0,0,0,null,"Legacy - Min Wood Pole (<11M)","LWPMI",232429,232,429,0,0,0,0]
[null,null,"Subrbn 70W HPS c/w D2 PECB-STD","HP70ST","Streetlight Lantern - HPS/MH Type",0,0,577,877,0,745,null,null,null,null,null,null,"18W LED Bourke Hill S-S","L018BH",0,0,437,761,0,0,"Streetlight Lantern - LED Type",null,null,null,null,null,null,null,"Outreach (Al) - Major (>3M)","OTAMA",null,0,0,0,0,0,0,null,"Outreach - Major (>2M)","OTMA",691991791,0,0,691,991,0,791,null,"Legacy - Maj Wood Pole (>11M)","LWPMA",null,233,430,0,0,0,0,null,"Pole (Wd) - Major (>11M)","PWMA",598898789,0,0,598,898,0,789]
[null,null,"9W LED STREETLED Aeroscreen S-","L009SA","Streetlight Lantern - LED Type",0,0,434,758,0,0,null,null,null,null,null,null,"18W LED P4 Gerard","L018ST",0,0,585,885,0,0,"Streetlight Lantern - LED Type",null,null,null,null,null,null,null,"Outreach (Al) - Minor (<=3M)","OTAMI",null,0,0,0,0,0,0,null,"Outreach - Minor (<2M)","OTMI",690990790,0,0,690,990,0,790,null,"Legacy - Min Wood Pole (<11M)","LWPMI",null,232,429,0,0,0,0,null,"Pole (Wd) - Maj-Ded Sl (>11M)","PWMAD",596896798,0,0,596,896,0,798]
[null,null,"13W LED ATS PLED MKII","L013AP","Streetlight Lantern - LED Type",0,0,456,780,0,0,null,null,null,null,null,null,"24W LED Bourke Hill S-S","L024BH",0,0,438,762,0,0,"Streetlight Lantern - LED Type",null,null,null,null,null,null,null,"Outreach - Major (>2M)","OTMA",null,0,0,691,991,0,791,null,null,null,null,null,null,null,null,null,null,null,"Pole (Wd) - Major (>11M)","PWMA",null,0,0,598,898,0,789,null,"Pole (Wd) - Minor (<11M)","PWMI",597897788,0,0,597,897,0,788]
[null,null,"13W LED STREETLED3 STD Visor S","L013SS","Streetlight Lantern - LED Type",0,0,433,757,0,0,null,null,null,null,null,null,"24W LED STREETLED3 STD Visor S","L024SS",0,0,431,755,0,0,"Streetlight Lantern - LED Type",null,null,null,null,null,null,null,"Outreach - Minor (<2M)","OTMI",null,0,0,690,990,0,790,null,null,null,null,null,null,null,null,null,null,null,"Pole (Wd) - Maj-Ded Sl (>11M)","PWMAD",null,0,0,596,896,0,798,null,"Pole (Wd) - Min-Ded Sl (<11M)","PWMID",595895797,0,0,595,895,0,797]
[null,null,"14W BOURKE HILL AVE 3K SIDE EN","L0143S",0,0,0,0,0,0,0,null,null,null,null,null,null,"25W LED P4 Gerard","L025ST",0,0,567,867,0,700,"Streetlight Lantern - LED Type",null,null,null,null,null,null,null,null,null,null,null,null,null,null,null,null,null,null,null,null,null,null,null,null,null,null,null,"Pole (Wd) - Minor (<11M)","PWMI",null,0,0,597,897,0,788]
[null,null,"14W BOURKE HILL AVE 3K TOP ENT","L0143T",0,0,0,0,0,0,0,null,null,null,null,null,null,"28W LED Post Top B2001 S-S","L028PT",0,0,436,760,0,0,"Streetlight Lantern - LED Type",null,null,null,null,null,null,null,null,null,null,null,null,null,null,null,null,null,null,null,null,null,null,null,null,null,null,null,"Pole (Wd) - Min-Ded Sl (<11M)","PWMID",null,0,0,595,895,0,797]
[null,null,"17W LED Post Top B2001 S-S","L017PS","Streetlight Lantern - LED Type",0,0,435,759,0,0,null,null,null,null,null,null,"33W LED P3 Gerard","L033SL",0,0,653,953,0,963,"Streetlight Lantern - LED Type"]
[null,null,"17W LED B2001 NUWE Post Top","L017PT","Streetlight Lantern - LED Type",0,0,665,965,0,0,null,null,null,null,null,null,"33W LED P4 Pecan","L033ST",0,0,587,887,0,702,"Streetlight Lantern - LED Type"]
[null,null,"17W LED STREETLED3 Aeroscreen","L017SA","Streetlight Lantern - LED Type",0,0,432,756,0,0,null,null,null,null,null,null,"37W LED 4K ROADLED MIDI STD Visor S-S","L037RM",0,0,439,763,0,0,"Streetlight Lantern - LED Type"]
[null,null,"17W LED P4","L017ST","Streetlight Lantern - LED Type",0,0,589,889,0,704,null,null,null,null,null,null,"40W LED 3K ROADLED MIDI STD Visor S-S","L040RM",0,0,440,764,0,0,"Streetlight Lantern - LED Type"]
[null,null,"18W LED Bourke Hill S-S","L018BH","Streetlight Lantern - LED Type",0,0,437,761,0,0,null,null,null,null,null,null,"42W LED P4 Gerard","L042ST",0,0,586,886,0,701,"Streetlight Lantern - LED Type"]
[null,null,"18W LED P4 Gerard","L018ST","Streetlight Lantern - LED Type",0,0,585,885,0,0,null,null,null,null,null,null,"55W LED 4K ROADLED MIDI STD Visor S-S","L055RM",0,0,443,767,0,0,"Streetlight Lantern - LED Type"]
[null,null,"20W LED ATS PLED MKII","L020AP",0,0,0,0,0,0,0,null,null,null,null,null,null,"57W LED STREETLED Aeroscreen S-S","L057RM",0,0,445,769,0,0,"Streetlight Lantern - LED Type"]
[null,null,"24W LED Bourke Hill S-S","L024BH","Streetlight Lantern - LED Type",0,0,438,762,0,0,null,null,null,null,null,null,"60W LED RoadLED Midi","L060LA",0,0,659,959,0,0,"Streetlight Lantern - LED Type"]
[null,null,"24W LED STREETLED3 STD Visor S","L024SS","Streetlight Lantern - LED Type",0,0,431,755,0,0,null,null,null,null,null,null,"61W LED 3K ROADLED MIDI STD Visor S-S","L061RM",0,0,444,768,0,0,"Streetlight Lantern - LED Type"]
[null,null,"25W LED P4 Gerard","L025ST","Streetlight Lantern - LED Type",0,0,567,867,0,700,null,null,null,null,null,null,"70W LED RoadLED Midi","L070LA",0,0,661,961,0,0,"Streetlight Lantern - LED Type"]
[null,null,"28W LED Post Top B2001 S-S","L028PT","Streetlight Lantern - LED Type",0,0,436,760,0,0,null,null,null,null,null,null,"74W LED ATS VLED","L074AV",0,0,457,781,0,0,"Streetlight Lantern - LED Type"]
[null,null,"30W LED ATS PLED MKII","L030AP",0,0,0,0,0,0,0,null,null,null,null,null,null,"75W LED Aglo Nilum Plus FLOODLIGHT","L075FL",0,0,655,955,0,0,"Streetlight Lantern - LED Type"]
[null,null,"33W LED P3 Gerard","L033SL","Streetlight Lantern - LED Type",0,0,653,953,0,963,null,null,null,null,null,null,"80W LED RoadLED Midi Optic Tuner","L080LO",0,0,660,960,0,0,"Streetlight Lantern - LED Type"]
[null,null,"33W LED P4 Pecan","L033ST","Streetlight Lantern - LED Type",0,0,587,887,0,702,null,null,null,null,null,null,"80W LED RoadLED Midi","L081LA",0,0,662,962,0,0,"Streetlight Lantern - LED Type"]
[null,null,"36W LED 4K ROADLED MIDI Aerosc","L036RA",0,0,0,0,0,0,0,null,null,null,null,null,null,"80W LED Bourke Hill LED","L081LA",0,0,662,962,0,0,"Streetlight Lantern - LED Type"]
[null,null,"37W LED 4K ROADLED MIDI STD Vi","L037RM","Streetlight Lantern - LED Type",0,0,439,763,0,0,null,null,null,null,null,null,"82W LED Gerard V5 Cat","L082ST",0,0,650,950,0,705,"Streetlight Lantern - LED Type"]
[null,null,"39W LED 3K ROADLED MIDI Aerosc","L039RM",0,0,0,0,0,0,0,null,null,null,null,null,null,"100W LED Aglo Nilum Plus FLOODLIGHT","L100FL",0,0,656,956,0,0,"Streetlight Lantern - LED Type"]
[null,null,"40W LED 3K ROADLED MIDI STD Vi","L040RM","Streetlight Lantern - LED Type",0,0,440,764,0,0,null,null,null,null,null,null,"100W LED Gerard V4 Cat","L100ST",0,0,651,951,0,706,"Streetlight Lantern - LED Type"]
[null,null,"42W LED P4 Gerard","L042ST","Streetlight Lantern - LED Type",0,0,586,886,0,701,null,null,null,null,null,null,"113W LED ROADLED MIDI STD Visor S-S","L113RM",0,0,447,771,0,0,"Streetlight Lantern - LED Type"]
[null,null,"55W LED 4K ROADLED MIDI STD Vi","L055RM","Streetlight Lantern - LED Type",0,0,443,767,0,0,null,null,null,null,null,null,"120W LED 4K RoadLED MIDI Aeroscreen S-S","L120RM",0,0,448,772,0,0,"Streetlight Lantern - LED Type"]
[null,null,"57W LED 4K ROADLED MIDI Aerosc","L057RM",{"$f":"IFERROR(VLOOKUP($D36,$S$1:$Z$81,MATCH(E$1,$S$1:$Z$1,0),FALSE),0)","v":"Streetlight Lantern - LED Type"},0,0,445,769,0,0,null,null,null,null,null,null,"25W LED P4 GE","L125ST",0,0,588,888,0,703,"Streetlight Lantern - LED Type"]
[null,null,"60W LED RoadLED Midi","L060LA","Streetlight Lantern - LED Type",0,0,659,959,0,0,null,null,null,null,null,null,"150W LED Aglo Nilum Plus FLOODLIGHT","L150FL",0,0,657,957,0,0,"Streetlight Lantern - LED Type"]
[null,null,"60W LED RoadLED Midi Opt Tuner","L060LO",0,0,0,0,0,0,0,null,null,null,null,null,null,"150W LED Bourke Hill LED","L150FL",0,0,657,957,0,0,"Streetlight Lantern - LED Type"]
[null,null,"61W LED 3K ROADLED MIDI STD Vi","L061RM","Streetlight Lantern - LED Type",0,0,444,768,0,0,null,null,null,null,null,null,"150W LED SLED Maximus Pedstrian","L150MP",0,0,667,967,0,0,"Streetlight Lantern - LED Type"]
[null,null,"63W LED 3K ROADLED MIDI Aerosr","L063RM",0,0,0,0,0,0,0,null,null,null,null,null,null,"165W LED RoadLED Midi","L165LA",0,0,664,964,0,0,"Streetlight Lantern - LED Type"]
[null,null,"70W LED RoadLED Midi","L070LA","Streetlight Lantern - LED Type",0,0,661,961,0,0,null,null,null,null,null,null,"175W LED SLED Maximus Pedstrian","L175MP",0,0,668,968,0,0,"Streetlight Lantern - LED Type"]
[null,null,"74W LED ATS VLED","L074AV","Streetlight Lantern - LED Type",0,0,457,781,0,0,null,null,null,null,null,null,"198W LED Gerard V2/V3 Cat","L198ST",0,0,652,952,0,707,"Streetlight Lantern - LED Type"]
[null,null,"75W LED Aglo Nilum Plus FldLgt","L075FL","Streetlight Lantern - LED Type",0,0,655,955,0,0,null,null,null,null,null,null,"205W LED 3K ROADLED MIDI Aeroscreen S-S","L205RM",0,0,453,777,0,0,"Streetlight Lantern - LED Type"]
[null,null,"80W BOURKE HILL 3K FTB","L080BH",0,0,0,0,0,0,0,null,null,null,null,null,null,"230W LED Avento S-S","L230AS",0,0,452,776,0,0,"Streetlight Lantern - LED Type"]
[null,null,"80W LED RoadLED Midi Opt Tuner","L080LO","Streetlight Lantern - LED Type",0,0,660,960,0,0,null,null,null,null,null,null,"254W LED 3K ROADLED MIDI STD Visor S-S","L254RM",0,0,451,775,0,0,"Streetlight Lantern - LED Type"]
[null,null,"80W LED RoadLED Midi","L081LA","Streetlight Lantern - LED Type",0,0,662,962,0,0,null,null,null,null,null,null,"275W LED ROADLED S-S","L275RS",0,0,450,774,0,0,"Streetlight Lantern - LED Type"]
[null,null,"82W LED Gerard V5 Cat","L082ST","Streetlight Lantern - LED Type",0,0,650,950,0,705,null,null,null,null,null,null,"290W LED ATS VLED","L290AV",0,0,459,783,0,0,"Streetlight Lantern - LED Type"]
[null,null,"100W LED Aglo Nilum Plus FLDLT","L100FL","Streetlight Lantern - LED Type",0,0,656,956,0,0,null,null,null,null,null,null,"300W LED Aglo Nilum Plus FLOOD","L300LA",0,0,658,958,0,0,"Streetlight Lantern - LED Type"]
[null,null,"100W LED Gerard V4 Cat","L100ST","Streetlight Lantern - LED Type",0,0,651,951,0,706,null,null,null,null,null,null,"42W CFL - AEROSCREEN","CF42AS",0,0,578,878,0,746,"Streetlight Lantern - Fluro Type"]
[null,null,"113W LED ROADLED MIDI STD Viso","L113RM","Streetlight Lantern - LED Type",0,0,447,771,0,0,null,null,null,null,null,null,"42W CFL - BOURKE HILL","CF42BH",0,0,583,883,0,751,"Streetlight Lantern - Fluro Type"]
[null,null,"120W LED 4K ROADLED MIDI Aeros","L120RM","Streetlight Lantern - LED Type",0,0,448,772,0,0,null,null,null,null,null,null,"42W CFL - POST TOP","CF42PT",0,0,580,880,0,748,"Streetlight Lantern - Fluro Type"]
[null,null,"121W LED 3K ROADLED MIDI Aeros","L121RM",0,0,0,0,0,0,0,null,null,null,null,null,null,"42W CFL - STANDARD","CF42ST",0,0,553,853,0,718,"Streetlight Lantern - Fluro Type"]
[null,null,"25W LED P4 GE","L125ST","Streetlight Lantern - LED Type",0,0,588,888,0,703,null,null,null,null,null,null,"100W Sodium - AEROSCREEN","HP10AS",0,0,579,879,0,747,"Streetlight Lantern - HPS/MH Type"]
[null,null,"150W LED 3K FLX ATS FLOODX","L1503F",0,0,0,0,0,0,0,null,null,null,null,null,null,"150W Sodium - FLOODLIGHT","HP15FL",0,0,581,881,0,749,"Streetlight Lantern - HPS/MH Type"]
[null,null,"150W LED 4K FLX ATS FLOODX","L1504F",0,0,0,0,0,0,0,null,null,null,null,null,null,"250W Sodium - PARKVILLE","HP25PV",0,0,584,884,0,752,"Streetlight Lantern - HPS/MH Type"]
[null,null,"150W LED Aglo Nilum Plus FLDLT","L150FL","Streetlight Lantern - LED Type",0,0,657,957,0,0,null,null,null,null,null,null,"Suburban 70 Watt HPS c/w D2 PECB - STANDARD","HP70ST",0,0,577,877,0,745,"Streetlight Lantern - HPS/MH Type"]
[null,null,"150W LED SLED Maximus Pedstran","L150MP","Streetlight Lantern - LED Type",0,0,667,967,0,0,null,null,null,null,null,null,"50W Mercury - STANDARD","M50ST",0,0,554,854,0,725,"Gen, Streetlight Lantern"]
[null,null,"150W PVILLE 3K FTB","L150P3",0,0,0,0,0,0,0,null,null,null,null,null,null,"80W Mercury - AEROSCREEN","M80AS",0,0,564,864,0,732,"Gen, Streetlight Lantern"]
[null,null,"155W LED ATS VLED","L155AV",0,0,0,0,0,0,0,null,null,null,null,null,null,"80W Mercury - POST TOP","M80PT",0,0,572,872,0,738,"Gen, Streetlight Lantern"]
[null,null,"165W LED RoadLED Midi","L165LA","Streetlight Lantern - LED Type",0,0,664,964,0,0,null,null,null,null,null,null,"80W Mercury - STANDARD","M80ST",0,0,555,855,0,710,"Gen, Streetlight Lantern"]
[null,null,"175W LED SLED Maximus Pedstran","L175MP","Streetlight Lantern - LED Type",0,0,668,968,0,0,null,null,null,null,null,null,"100W Metal Halide - STANDARD","MH10ST",0,0,558,858,0,728,"Streetlight Lantern - HPS/MH Type"]
[null,null,"198W LED Gerard V2/V3 Cat","L198ST","Streetlight Lantern - LED Type",0,0,652,952,0,707,null,null,null,null,null,null,"150W Metal Halide - AEROSCREEN","MH15AS",0,0,566,866,0,734,"Streetlight Lantern - HPS/MH Type"]
[null,null,"205W LED 3K ROADLED MIDI Aeros","L205RM","Streetlight Lantern - LED Type",0,0,453,777,0,0,null,null,null,null,null,null,"150W Metal Halide - FLOODLIGHT","MH15FL",0,0,582,882,0,750,"Streetlight Lantern - HPS/MH Type"]
[null,null,"230W LED Avento S-S","L230AS","Streetlight Lantern - LED Type",0,0,452,776,0,0,null,null,null,null,null,null,"150W Metal Halide - STANDARD","MH15ST",0,0,560,860,0,721,"Streetlight Lantern - HPS/MH Type"]
[null,null,"250W LED 3K FLX ATS FLOODX","L2503F",0,0,0,0,0,0,0,null,null,null,null,null,null,"250W Metal Halide - AEROSCREEN","MH25AS",0,0,569,869,0,736,"Streetlight Lantern - HPS/MH Type"]
[null,null,"250W LED 4K FLX ATS FLOODX","L2504F",0,0,0,0,0,0,0,null,null,null,null,null,null,"250W Metal Halide - FLOODLIGHT","MH25FL",0,0,574,874,0,740,"Streetlight Lantern - HPS/MH Type"]
[null,null,"254W LED 3K ROADLED MIDI STD V","L254RM","Streetlight Lantern - LED Type",0,0,451,775,0,0,null,null,null,null,null,null,"250W Metal Halide - STANDARD","MH25ST",0,0,562,862,0,722,"Streetlight Lantern - HPS/MH Type"]
[null,null,"275W LED ROADLED S-S","L275RS",{"$f":"IFERROR(VLOOKUP($D68,$S$1:$Z$81,MATCH(E$1,$S$1:$Z$1,0),FALSE),0)","v":"Streetlight Lantern - LED Type"},0,0,450,774,0,0,null,null,null,null,null,null,"400W Metal Halide - AEROSCREEN","MH40AS",0,0,571,871,0,715,"Streetlight Lantern - HPS/MH Type"]
[null,null,"290W LED ATS VLED","L290AV","Streetlight Lantern - LED Type",0,0,459,783,0,0,null,null,null,null,null,null,"400W Metal Halide - FLOODLIGHT","MH40FL",0,0,576,876,0,742,"Streetlight Lantern - HPS/MH Type"]
[null,null,"300W LED Aglo Nilum Plus FLOOD","L300LA","Streetlight Lantern - LED Type",0,0,658,958,0,0,null,null,null,null,null,null,"100W Sodium - STANDARD","S100ST",0,0,557,857,0,727,"Streetlight Lantern - HPS/MH Type"]
[null,null,"50W Mercury - STANDARD","M50ST","Gen, Streetlight Lantern",0,0,554,854,0,725,null,null,null,null,null,null,"150W Sodium - AEROSCREEN","S150AS",0,0,565,865,0,733,"Streetlight Lantern - HPS/MH Type"]
[null,null,"80W Mercury - AEROSCREEN","M80AS","Gen, Streetlight Lantern",0,0,564,864,0,732,null,null,null,null,null,null,"150W Sodium - STANDARD","S150ST",0,0,559,859,0,729,"Streetlight Lantern - HPS/MH Type"]
[null,null,"80W Mercury - POST TOP","M80PT","Gen, Streetlight Lantern",0,0,572,872,0,738,null,null,null,null,null,null,"250W Sodium - AEROSCREEN","S250AS",0,0,568,868,0,735,"Streetlight Lantern - HPS/MH Type"]
[null,null,"80W Mercury - STANDARD","M80ST","Gen, Streetlight Lantern",0,0,555,855,0,710,null,null,null,null,null,null,"250W Sodium - FLOODLIGHT","S250FL",0,0,573,873,0,739,"Streetlight Lantern - HPS/MH Type"]
[null,null,"100W Metal Halide - STANDARD","MH10ST","Streetlight Lantern - HPS/MH Type",0,0,558,858,0,728,null,null,null,null,null,null,"250W Sodium - STANDARD","S250ST",0,0,561,861,0,720,"Streetlight Lantern - HPS/MH Type"]
[null,null,"150W Metal Halide - AEROSCREEN","MH15AS","Streetlight Lantern - HPS/MH Type",0,0,566,866,0,734,null,null,null,null,null,null,"400W Sodium - AEROSCREEN","S400AS",0,0,570,870,0,737,"Streetlight Lantern - HPS/MH Type"]
[null,null,"150W Metal Halide - FLOODLIGHT","MH15FL","Streetlight Lantern - HPS/MH Type",0,0,582,882,0,750,null,null,null,null,null,null,"400W Sodium - FLOODLIGHT","S400FL",0,0,575,875,0,741,"Streetlight Lantern - HPS/MH Type"]
[null,null,"150W Metal Halide - STANDARD","MH15ST","Streetlight Lantern - HPS/MH Type",0,0,560,860,0,721,null,null,null,null,null,null,"400W Sodium - STANDARD","S400ST",0,0,563,863,0,731,"Streetlight Lantern - HPS/MH Type"]
[null,null,"250W Metal Halide - AEROSCREEN","MH25AS","Streetlight Lantern - HPS/MH Type",0,0,569,869,0,736,null,null,null,null,null,null,"70W Sodium - STANDARD","S70ST",0,0,556,856,0,726,"Streetlight Lantern - HPS/MH Type"]
[null,null,"250W Metal Halide - FLOODLIGHT","MH25FL","Streetlight Lantern - HPS/MH Type",0,0,574,874,0,740,null,null,null,null,null,null,"2x14W T5 FL - STANDARD","T514ST",0,0,551,851,0,716,"Streetlight Lantern - Fluro Type"]
[null,null,"250W Metal Halide - STANDARD","MH25ST","Streetlight Lantern - HPS/MH Type",0,0,562,862,0,722,null,null,null,null,null,null,"2x24W T5 FL - STANDARD","T524ST",0,0,552,852,0,717,"Streetlight Lantern - Fluro Type"]
[null,null,"400W Metal Halide - AEROSCREEN","MH40AS","Streetlight Lantern - HPS/MH Type",0,0,571,871,0,715]
[null,null,"400W Metal Halide - FLOODLIGHT","MH40FL","Streetlight Lantern - HPS/MH Type",0,0,576,876,0,742]
[null,null,"RTA Fluorescent 18W","R250",0,0,0,0,0,0,0]
[null,null,"RTA Fluorescent 20W","R251",0,0,0,0,0,0,0]
[null,null,"RTA High Pressure Sodium 100W","R252",0,0,0,0,0,0,0]
[null,null,"RTA High Pressure Sodium 150W","R253",0,0,0,0,0,0,0]
[null,null,"RTA High Pressure Sodium 250W","R254",0,0,0,0,0,0,0]
[null,null,"RTA High Pressure Sodium 400W","R255",0,0,0,0,0,0,0]
[null,null,"RTA LED 17W","R256",0,0,0,0,0,0,0]
[null,null,"RTA LED 85W 4000K","R257",0,0,0,0,0,0,0]
[null,null,"RTA LED 175W 4000K","R258",0,0,0,0,0,0,0]
[null,null,"RTA LED 198W 4000K","R259",0,0,0,0,0,0,0]
[null,null,"RTA LED 200W 4000K","R260",0,0,0,0,0,0,0]
[null,null,"RTA LED 265W 4000K","R261",0,0,0,0,0,0,0]
[null,null,"RTA LED 275W 4000K","R262",0,0,0,0,0,0,0]
[null,null,"RTA LED 198W 4000K (259)","RLD198",0,0,0,0,0,0,0]
[null,null,"100W Sodium - STANDARD","S100ST","Streetlight Lantern - HPS/MH Type",0,0,557,857,0,727]
[null,null,"150W Sodium - AEROSCREEN","S150AS","Streetlight Lantern - HPS/MH Type",0,0,565,865,0,733]
[null,null,"150W Sodium - STANDARD","S150ST","Streetlight Lantern - HPS/MH Type",0,0,559,859,0,729]
[null,null,"250W Sodium - AEROSCREEN","S250AS","Streetlight Lantern - HPS/MH Type",0,0,568,868,0,735]
[null,null,"250W Sodium - FLOODLIGHT","S250FL","Streetlight Lantern - HPS/MH Type",0,0,573,873,0,739]
[null,null,"250W Sodium - STANDARD","S250ST","Streetlight Lantern - HPS/MH Type",0,0,561,861,0,720]
[null,null,"400W Sodium - AEROSCREEN","S400AS","Streetlight Lantern - HPS/MH Type",0,0,{"$f":"IFERROR(VLOOKUP($D104,$S$1:$Z$81,MATCH(H$1,$S$1:$Z$1,0),FALSE),0)","v":570},870,0,737]
[null,null,"400W Sodium - FLOODLIGHT","S400FL",{"$f":"IFERROR(VLOOKUP($D105,$S$1:$Z$81,MATCH(E$1,$S$1:$Z$1,0),FALSE),0)","v":"Streetlight Lantern - HPS/MH Type"},0,0,575,875,0,741]
[null,null,"400W Sodium - STANDARD","S400ST","Streetlight Lantern - HPS/MH Type",0,0,563,863,0,731]
[null,null,"70W Sodium - STANDARD","S70ST","Streetlight Lantern - HPS/MH Type",0,0,556,856,0,726]
[null,null,"2x14W T5 FL - STANDARD","T514ST","Streetlight Lantern - Fluro Type",0,0,551,851,0,716]
[null,null,"2x24W T5 FL - STANDARD","T524ST","Streetlight Lantern - Fluro Type",0,0,552,852,0,717]

{"sheet":"PROJECT","index":11,"n_rows":19,"n_cols":6,"rows_kept":19,"cut":false,"hidden":false,"merged":[[16,1,16,9],[17,1,17,9],[18,1,18,9],[19,0,19,10],[0,0,0,10],[6,6,6,7],[12,1,12,9],[13,1,13,9],[14,1,14,9],[15,1,15,9]]}
["Project Details"]
[]
[null,"CAP No:",null,"VAS2708",null,"External Use Only"]
[]
[null,"Project No:",null,null,null,"Endeavour Use Only"]
[]
[null,"Drawing No:     Retic:",null,null,null,"Duct:"]
[]
[null,"Phase:",null,"Design"]
[]
[]
["Instructions:"]
[null,"This spreadsheet is used to capture the attributes of all new and replaced equipment used in a project."]
[null,"On receipt of this file the spreadsheet will be pre-populated with the known equipment associated with the project. Only the sheets containing equipment associated with a project are to be filled."]
[null,"Project Sheet (This sheet) :This sheet is used to capture common details to all equipment."]
[null,"Remaining Sheets : For all other sheets each column defines a new piece of equipment associated with a project. The value of each attribute is to be entered into the cell to the right of the attribute name."]
[null,"Attributes inRED bold fontare mandatory and must be entered for each piece of equipment.\nAttributes inRED bold Italic fontare mandatory and read only, the values are auto-filled and shown for display purposes. Changing these values will not alter the Endeavour Equipment database.\nAttibutes inRED Italic fontare mandatory and auto-populated based on the drop down selection entry of other/above attibutes. In any case,if attributes with pre-populated fields are deleted and TAL uploaded with a blank field, the blank field will overwrite the pre-loaded information in SAP."]
[null,"Attributes in BLACK are not required for initial load. They are however required to be filled in either during progress loads or definitely on the final load."]
[null,"Some cells provide a list of values to select from. Only values from the list can be entered. Cells left empty will be ignored.\n\nSome cells provide a list of values to select from. Only values from the list can be \nentered."]

{"sheet":"POLE","index":12,"n_rows":79,"n_cols":11,"rows_kept":79,"cut":false,"hidden":false,"merged":[]}
["Source Code","Asset Type","Field","Min Value","Max Value","Field Entry","Default","Locked?","Additional info (Not in the VB","Poles"]
["FLOC","FLOC","Pre-Populated",null,null,null,null,"L",null,"Functional Location","POLE01004994"]
["REFLOC_D","FLOC","Pre-Populated",null,null,null,null,"L",null,"Reference Functional Location","POLEPOLE0001"]
["DELETIONFLAG","FLOC","CHAR",null,null,null,null,null,null,"Flag for Deletion (Mark as 'X')"]
["NULL"]
["SORTFIELD","FLOC","CHAR",0,30,null,null,null,null,"Pole Plate Number (Sort Field)","PL1004994"]
["SUPFLOC","FLOC","Pre-Populated",0,12,null,null,null,null,"Superior Functional Location"]
["FLOC_CONST_D","FLOC","LIST",null,null,null,null,"D",null,"FLOC Construction Type"]
["FLOC_TOT_D","FLOC","FLIST","SUBSWITCHES",null,null,null,"D","ST_POLEST","FLOC Technical Object Type","Structure Pole"]
["MAINTLOC","FLOC","LIST",null,null,null,null,"D",null,"Location","Kings Park Field ServiceCentre"]
["ABCKZ","FLOC","LIST",null,null,null,null,null,null,"ABC Indicator","Outage Dependant Obj"]
["NULL"]
["NULL",null,null,null,null,null,null,null,null,"Network General Characteristics"]
["URBAN","FLOC","LIST",0,3,null,null,null,null,"Urban"]
["NULL"]
["NULL",null,null,null,null,null,null,null,null,"FLOC Characteristics"]
["CREEK_CROSSING","FLOC","LIST",0,3,null,null,null,null,"Creek Crossing"]
["EQUIPMENT_OWNER","FLOC, EQ01","LIST",0,17,null,null,"D",null,"Equipment Owner"]
["ICELOAD_AREA","FLOC","LIST",0,3,null,null,null,null,"Ice Loading Area"]
["POLE_EQUIP_FUNCTION","FLOC, EQ01","LIST",0,16,null,null,null,null,"Pole Equipment Function"]
["POLE_FUNCTION","FLOC, EQ01","LIST",0,21,null,null,null,null,"Pole Function"]
["RIVER_CROSSING_NAV","FLOC","LIST",0,3,null,null,null,null,"River Crossing Navigable"]
["STRUCTURE","FLOC","CHAR",0,5,null,null,null,null,"Structure No (Trans)"]
["SPECIAL_USE_CODE","FLOC","LIST",0,30,null,null,"D",null,"Special Use Code"]
["VOLTAGE_NOMINAL","FLOC","LIST",0,999999,null,null,null,null,"Voltage - Nominal (V)"]
["NULL"]
["NULL",null,null,null,null,null,null,null,null,"Equipment Characteristics"]
["EQ_NUM","EQ01","Pre-Populated",null,null,null,null,"L",null,"Equipment Number"]
["REF_EQ_D","EQ01","ELIST","POLE",null,null,null,"D",null,"EQ Reference Equipment Desc"]
["EQ_TOT_D","EQ01","Pre-Populated",null,null,null,null,"D",null,"EQ Technical Object Type"]
["DATECOMM","EQ01","DATE","1990-01-01","2100-12-31",null,null,"C",null,"Commissioned Date (DD/MM/YYYY)"]
["SL_VERT_SUPPORT","EQ01","LIST",0,6,null,null,null,null,"Streetlight Vertical Support"]
["SL_TARIFF_CLASS","EQ01","LIST",0,2,null,null,null,null,"Streetlight Tariff Class"]
["SL_TARIFF_RATE","EQ01","CHAR",0,30,null,null,"L",null,"Streetlight Tariff Rate"]
["NULL"]
["MANU","EQ01","CHAR",0,30,null,null,null,null,"Manufacturer"]
["MANUPARTNO","EQ01","CHAR",0,30,null,null,null,null,"Manufacturer Part No"]
["MANUSERNO","EQ01","CHAR",0,30,null,null,null,null,"Manufacturer Serial No"]
["MANUCOUNT","EQ01","LIST",0,2,null,null,null,null,"Manufacturer Country"]
["CONSTMONTH","EQ01","NUM",1,12,null,null,null,null,"Manufacturer Month"]
["CONSTYEAR","EQ01","NUM",1,9999,null,null,null,null,"Manufacturer Year"]
["NULL"]
["BURIAL_DEPTH","EQ01","DEC",0,9.9,null,null,null,null,"Pole Burial Depth (m)"]
["POLE_LENGTH","EQ01","DEC",0,30,null,null,null,null,"Pole length (m)"]
["POLE_STRENGTH","EQ01","DEC",0,99.9,null,null,null,null,"Pole Strength on disc (kN)"]
["POLE_SPECIES","EQ01","LIST",0,20,"WoodPole",null,null,null,"Pole Species"]
["POLE_TYPE","EQ01","LIST",0,20,"WoodPole",null,null,null,"Pole Type"]
["ORIGINAL_POLE_DIAMETER","EQ01","NUM",0,999,"WoodPole",null,null,null,"Original Pole Dia groundline (Wood Only)"]
["PRO_REMV_STS","EQ01","CHAR",0,1,null,null,"L",null,"Proposed Removed"]
["PRO_REMV_EQ_NO","EQ01","Pre-Populated",null,null,null,null,"L",null,"Proposed Removed Equipment Number"]
["NULL"]
["NULL",null,null,null,null,null,null,null,null,"Assembly"]
["FLOC","FLOC","Pre-Populated",null,null,null,null,"L",null,"Functional Location","ASSM00739414"]
["REFLOC_D","FLOC","Pre-Populated",null,null,null,null,"L",null,"Reference Functional Location","ASSMPOLE0001"]
["DELETIONFLAG","FLOC","CHAR",null,null,null,null,null,null,"Flag for Deletion (Mark as 'X')"]
["NULL"]
["SORTFIELD","FLOC","CHAR",0,30,null,null,null,null,"ASSM Plate Number (Sort Field)"]
["SUPFLOC","FLOC","Pre-Populated",0,12,null,null,"D",null,"Superior Functional Location","POLE01004994"]
["FLOC_CONST_D","FLOC","LIST",null,null,null,null,"D",null,"FLOC Construction Type"]
["FLOC_TOT_D","FLOC","LIST",null,null,null,null,"D","LIST","FLOC Technical Object Type"]
["MAINTLOC","FLOC","LIST",null,null,null,null,"D",null,"Location","Kings Park Field ServiceCentre"]
["ABCKZ","FLOC","LIST",null,null,null,null,null,null,"ABC Indicator","Outage Dependant Obj"]
["NULL"]
["NULL",null,null,null,null,null,null,null,null,"Network General Characteristics"]
["URBAN","FLOC","LIST",0,3,null,null,null,null,"Urban"]
["NULL"]
["NULL",null,null,null,null,null,null,null,null,"FLOC Characteristics"]
["EQUIPMENT_OWNER","FLOC, EQ01","LIST",0,17,null,null,"D",null,"Equipment Owner"]
["VOLTAGE_NOMINAL","FLOC, EQ01","LIST",0,999999,null,null,null,null,"Voltage - Nominal (V)"]
["NULL"]
["NULL",null,null,null,null,null,null,null,null,"Equipment Characteristics"]
["EQ_NUM","EQ01","Pre-Populated",null,null,null,null,"L",null,"Equipment Number"]
["REF_EQ_D","EQ01","ELIST","ASSM",null,null,null,"D",null,"EQ Reference Equipment Desc"]
["EQ_TOT_D","EQ01","Pre-Populated",null,null,null,null,"D",null,"EQ Technical Object Type"]
["DATECOMM","EQ01","DATE","1990-01-01","2100-12-31",null,null,"C",null,"Commissioned Date (DD/MM/YYYY)"]
["PRO_REMV_STS","EQ01","CHAR",0,1,null,null,"L",null,"Proposed Removed"]
["PRO_REMV_EQ_NO","EQ01","Pre-Populated",null,null,null,null,"L",null,"Proposed Removed Equipment Number"]
["NULL"]
[null,null,null,null,null,null,null,null,null,"Comments"]

{"sheet":"COLUMN","index":13,"n_rows":74,"n_cols":11,"rows_kept":74,"cut":false,"hidden":false,"merged":[]}
["Source Code","Asset Type","Field","Min Value","Max Value","Field Entry","Default","Locked?",null,"Columns"]
["FLOC","FLOC","Pre-Populated",null,null,null,null,"L",null,"Functional Location","CLMN09557866"]
["REFLOC_D","FLOC","Pre-Populated",null,null,null,null,"L",null,"Reference Functional Location","CLMNCLMN0001"]
["DELETIONFLAG","FLOC","CHAR",0,1,null,null,null,null,"Flag for Deletion (Mark as 'X')"]
["NULL"]
["SORTFIELD","FLOC","CHAR",0,30,null,null,null,null,"Column Plate Number (Sort Field)","CL9557866"]
["SUPFLOC","FLOC","Pre-Populated",0,12,null,null,null,null,"Superior Functional Location"]
["FLOC_CONST_D","FLOC","LIST",null,null,null,null,"D",null,"FLOC Construction Type"]
["FLOC_TOT_D","FLOC","LIST",null,null,null,null,"D","ST_CLMNST","Technical Object Type"]
["MAINTLOC","FLOC","LIST",null,null,null,null,"D",null,"Location","Kings Park Field ServiceCentre"]
["ABCKZ","FLOC","LIST",null,null,null,null,null,null,"ABC Indicator","Outage Dependant Obj"]
["NULL"]
["NULL",null,null,null,null,null,null,null,null,"Network General Characteristics"]
["URBAN","FLOC","LIST",0,3,null,null,null,null,"Urban"]
["NULL"]
["NULL",null,null,null,null,null,null,null,null,"FLOC Characteristics"]
["COLUMN_FUNCTION","FLOC, EQ01","LIST",0,21,null,null,null,null,"Column Function"]
["LOCATION_ZONE","FLOC, EQ01","LIST",0,20,null,null,null,null,"Location Zone"]
["EQUIPMENT_OWNER","FLOC, EQ01","LIST",0,17,null,null,"D",null,"Equipment Owner"]
["SL_TARIFF_CLASS","FLOC","LIST",0,2,null,null,null,null,"Streetlight Tariff Class"]
["SLCP","FLOC, EQ01","CHAR",0,8,null,null,null,null,"SLCP No"]
["NULL"]
["NULL",null,null,null,null,null,null,null,null,"Equipment Characteristics"]
["EQ_NUM","EQ01","Pre-Populated",null,null,null,null,"L",null,"Equipment Number"]
["REF_EQ_D","EQ01","ELIST","COLUMN",null,null,null,"D",null,"EQ Reference Equipment Desc"]
["EQ_TOT_D","EQ01","Pre-Populated",null,null,null,null,"D",null,"EQ Technical Object Type"]
["SL_VERT_SUPPORT","EQ01","LIST",0,6,null,null,"D",null,"Streetlight Vertical Support"]
["SL_TARIFF_CLASS","EQ01","LIST",0,2,null,null,"D",null,"Streetlight Tariff Class"]
["SL_TARIFF_RATE","EQ01","CHAR",0,30,null,null,"L",null,"Streetlight Tariff Rate"]
["DATECOMM","EQ01","DATE","1990-01-01","2100-12-31",null,null,"C",null,"Commissioned Date (DD/MM/YYYY)"]
["NULL"]
["MANU","EQ01","CHAR",0,30,null,null,null,null,"Manufacturer"]
["MANUPARTNO","EQ01","CHAR",0,30,null,null,null,null,"Manufacturer Part No"]
["MANUSERNO","EQ01","CHAR",0,30,null,null,null,null,"Manufacturer Serial No"]
["MANUCOUNT","EQ01","LIST",0,2,null,null,null,null,"Manufacturer Country"]
["CONSTMONTH","EQ01","NUM",1,12,null,null,null,null,"Manufacturer Month"]
["CONSTYEAR","EQ01","NUM",1,9999,null,null,null,null,"Manufacturer Year"]
["NULL"]
["NULL",null,null,null,null,null,null,null,null,"Column Characteristics"]
["LEGACY_ANNUITY","EQ01","CHAR",0,7,null,null,null,null,"Legacy or Annuity Rate Code"]
["MAST_LENGTH","EQ01","DEC",0,99.9,null,null,null,null,"Mast Length (m)"]
["CL_SL_VERT_SUPPORT","EQ01","LIST",0,6,null,null,null,"LIST","Streetlight Vertical Support"]
["UNMETERED_SUPPLY","EQ01","LIST",0,3,null,null,null,"LIST","Unmetered Supply"]
["PRO_REMV_STS","EQ01","CHAR",0,1,null,null,"L",null,"Proposed Removed"]
["PRO_REMV_EQ_NO","EQ01","Pre-Populated",null,null,null,null,"L",null,"Proposed Removed Equipment Number"]
["NULL"]
["NULL",null,null,null,null,null,null,null,null,"Assembly"]
["FLOC","FLOC","Pre-Populated",null,null,null,null,"L",null,"Functional Location","ASSM00739415"]
["REFLOC_D","FLOC","Pre-Populated",null,null,null,null,"L",null,"Reference Functional Location","ASSMCLMN0001"]
["DELETIONFLAG","FLOC","CHAR",null,null,null,null,null,null,"Flag for Deletion (Mark as 'X')"]
["NULL"]
["SORTFIELD","FLOC","CHAR",0,30,null,null,null,null,"ASSM Plate Number (Sort Field)"]
["SUPFLOC","FLOC","Pre-Populated",0,12,null,null,"D",null,"Superior Functional Location","CLMN09557866"]
["FLOC_CONST_D","FLOC","LIST",null,null,null,null,"D",null,"FLOC Construction Type"]
["FLOC_TOT_D","FLOC","LIST",null,null,null,null,"D","LIST","FLOC Technical Object Type"]
["MAINTLOC","FLOC","LIST",null,null,null,null,"D",null,"Location","Kings Park Field ServiceCentre"]
["ABCKZ","FLOC","LIST",null,null,null,null,null,null,"ABC Indicator","Outage Dependant Obj"]
["NULL"]
["NULL",null,null,null,null,null,null,null,null,"Network General Characteristics"]
["URBAN","FLOC","LIST",0,3,null,null,null,null,"Urban"]
["NULL"]
["NULL",null,null,null,null,null,null,null,null,"FLOC Characteristics"]
["EQUIPMENT_OWNER","FLOC, EQ01","LIST",0,17,null,null,"D",null,"Equipment Owner"]
["VOLTAGE_NOMINAL","FLOC, EQ01","LIST",0,999999,null,null,null,null,"Voltage - Nominal (V)"]
["NULL"]
["NULL",null,null,null,null,null,null,null,null,"Equipment Characteristics"]
["EQ_NUM","EQ01","Pre-Populated",null,null,null,null,"L",null,"Equipment Number"]
["REF_EQ_D","EQ01","ELIST","ASSM",null,null,null,"D",null,"EQ Reference Equipment Desc"]
["EQ_TOT_D","EQ01","Pre-Populated",null,null,null,null,"D",null,"EQ Technical Object Type"]
["DATECOMM","EQ01","DATE","1990-01-01","2100-12-31",null,null,"C",null,"Commissioned Date (DD/MM/YYYY)"]
["PRO_REMV_STS","EQ01","CHAR",0,1,null,null,"L",null,"Proposed Removed"]
["PRO_REMV_EQ_NO","EQ01","Pre-Populated",null,null,null,null,"L",null,"Proposed Removed Equipment Number"]
["NULL"]
[null,null,null,null,null,null,null,null,null,"Comments"]

{"sheet":"PILLAR","index":14,"n_rows":70,"n_cols":12,"rows_kept":70,"cut":false,"hidden":false,"merged":[]}
["Source Code","Asset Type","Field","Min Value","Max Value","Field Entry","Default","Locked?",null,"Pillars"]
["FLOC","FLOC","Pre-Populated",null,null,null,null,"L",null,"Functional Location","PILL00411701","PILL00411702"]
["REFLOC_D","FLOC","Pre-Populated",null,null,null,null,"L",null,"Reference Functional Location","PILLPILL0001","PILLPILL0001"]
["DELETIONFLAG","FLOC","CHAR",0,1,null,null,null,null,"Flag for Deletion (Mark as 'X')"]
["NULL"]
["SORTFIELD","FLOC","CHAR",0,30,null,null,null,null,"Pillar Plate Number (Sort Field)","LV411701","LV411702"]
["SUPFLOC","FLOC","Pre-Populated",0,12,null,null,null,null,"Superior Functional Location"]
["FLOC_CONST_D","FLOC","LIST",null,null,null,null,"D",null,"FLOC Construction Type"]
["FLOC_TOT_D","FLOC","LIST",null,null,null,null,"D","ST_PILLST","Technical Object Type","Structure LV Pillar","Structure LV Pillar"]
["MAINTLOC","FLOC","LIST",null,null,null,null,"D",null,"Location","Kings Park Field ServiceCentre","Kings Park Field ServiceCentre"]
["ABCKZ","FLOC","LIST",null,null,null,null,null,null,"ABC Indicator","Outage Dependant Obj","Outage Dependant Obj"]
["NULL"]
["NULL",null,null,null,null,null,null,null,null,"Network General Characteristics"]
["URBAN","FLOC","LIST",0,3,null,null,null,null,"Urban"]
["NULL"]
["NULL",null,null,null,null,null,null,null,null,"FLOC Characteristics"]
["CONNECTION_TYPE","FLOC, EQ01","LIST",0,7,null,null,null,null,"Connection Type"]
["EQUIPMENT_OWNER","FLOC, EQ01","LIST",0,17,null,null,"D",null,"Equipment Owner"]
["LOCATION_ZONE","FLOC","LIST",0,20,null,null,null,null,"Location Zone"]
["QUANTITY_OF_PHASES","FLOC, EQ01","LIST",0,7,null,null,null,null,"Phase - Qty"]
["UNMETERED_SUPPLY","FLOC, EQ01","LIST",0,3,null,null,null,null,"Unmetered Supply"]
["NULL"]
["NULL",null,null,null,null,null,null,null,null,"Equipment Characteristics"]
["EQ_NUM","EQ01","Pre-Populated",null,null,null,null,"L",null,"Equipment Number"]
["REF_EQ_D","EQ01","ELIST","PILLARS",null,null,null,"D",null,"EQ Reference Equipment Desc"]
["EQ_TOT_D","EQ01","Pre-Populated",null,null,null,null,"D",null,"EQ Technical Object Type"]
["DATECOMM","EQ01","DATE","1990-01-01","2100-12-31",null,null,"C",null,"Commissioned Date (DD/MM/YYYY)"]
["NULL"]
["MANU","EQ01","CHAR",0,30,null,null,null,null,"Manufacturer"]
["MANUPARTNO","EQ01","CHAR",0,30,null,null,null,null,"Manufacturer Part No"]
["MANUSERNO","EQ01","CHAR",0,30,null,null,null,null,"Manufacturer Serial No"]
["MANUCOUNT","EQ01","LIST",0,2,null,null,null,null,"Manufacturer Country"]
["CONSTMONTH","EQ01","NUM",1,12,null,null,null,null,"Manufacturer Month"]
["CONSTYEAR","EQ01","NUM",1,9999,null,null,null,null,"Manufacturer Year"]
["NULL"]
["PILLAR_BASE","EQ01","LIST",0,20,null,null,"C","LIST","Pillar Base"]
["PILLAR_ENCLOSURE","EQ01","LIST",0,20,null,null,"C","LIST","Pillar Enclosure"]
["PILLAR_FUNCTION","EQ01","LIST",0,21,null,null,"C","LIST","Pillar Function"]
["PILLAR_MOUNTING","EQ01","LIST",0,20,null,null,"C","LIST","Pillar Mounting"]
["PRO_REMV_STS","EQ01","CHAR",0,1,null,null,"L",null,"Proposed Removed"]
["PRO_REMV_EQ_NO","EQ01","Pre-Populated",null,null,null,null,"L",null,"Proposed Removed Equipment Number"]
["NULL"]
["NULL",null,null,null,null,null,null,null,null,"Assembly"]
["FLOC","FLOC","Pre-Populated",null,null,null,null,"L",null,"Functional Location","ASSM00739416","ASSM00739417"]
["REFLOC_D","FLOC","Pre-Populated",null,null,null,null,"L",null,"Reference Functional Location","ASSMPILL0001","ASSMPILL0001"]
["DELETIONFLAG","FLOC","CHAR",null,null,null,null,null,null,"Flag for Deletion (Mark as 'X')"]
["NULL"]
["SORTFIELD","FLOC","CHAR",0,30,null,null,null,null,"ASSM Plate Number (Sort Field)"]
["SUPFLOC","FLOC","Pre-Populated",0,12,null,null,"D",null,"Superior Functional Location","PILL00411701","PILL00411702"]
["FLOC_CONST_D","FLOC","LIST",null,null,null,null,"D",null,"FLOC Construction Type"]
["FLOC_TOT_D","FLOC","LIST",null,null,null,null,"D","LIST","FLOC Technical Object Type","UG Termination","UG Termination"]
["MAINTLOC","FLOC","LIST",null,null,null,null,"D",null,"Location","Kings Park Field ServiceCentre","Kings Park Field ServiceCentre"]
["ABCKZ","FLOC","LIST",null,null,null,null,null,null,"ABC Indicator","Outage Dependant Obj","Outage Dependant Obj"]
["NULL"]
["NULL",null,null,null,null,null,null,null,null,"Network General Characteristics"]
["URBAN","FLOC","LIST",0,3,null,null,null,null,"Urban"]
["NULL"]
["NULL",null,null,null,null,null,null,null,null,"FLOC Characteristics"]
["EQUIPMENT_OWNER","FLOC, EQ01","LIST",0,17,null,null,null,null,"Equipment Owner"]
["VOLTAGE_NOMINAL","FLOC, EQ01","LIST",0,999999,null,null,null,null,"Voltage - Nominal (V)"]
["NULL"]
["NULL",null,null,null,null,null,null,null,null,"Equipment Characteristics"]
["EQ_NUM","EQ01","Pre-Populated",null,null,null,null,"L",null,"Equipment Number"]
["REF_EQ_D","EQ01","ELIST","ASSM",null,null,null,"D",null,"EQ Reference Equipment Desc"]
["EQ_TOT_D","EQ01","Pre-Populated",null,null,null,null,"D",null,"EQ Technical Object Type"]
["DATECOMM","EQ01","DATE","1990-01-01","2100-12-31",null,null,"C",null,"Commissioned Date (DD/MM/YYYY)"]
["PRO_REMV_STS","EQ01","CHAR",0,1,null,null,"L",null,"Proposed Removed"]
["PRO_REMV_EQ_NO","EQ01","Pre-Populated",null,null,null,null,"L",null,"Proposed Removed Equipment Number"]
["NULL"]
[null,null,null,null,null,null,null,null,null,"Comments"]

{"sheet":"ASSM","index":15,"n_rows":26,"n_cols":14,"rows_kept":26,"cut":false,"hidden":true,"merged":[]}
["Source Code","Asset Type","Field","Min Value","Max Value","Field Entry","Default","Locked?",null,"Assembly"]
["FLOC","FLOC","Pre-Populated",null,null,null,null,"L",null,"Functional Location","ASSM00739414","ASSM00739415","ASSM00739416","ASSM00739417"]
["REFLOC_D","FLOC","Pre-Populated",null,null,null,null,"L",null,"Reference Functional Location","ASSMPOLE0001","ASSMCLMN0001","ASSMPILL0001","ASSMPILL0001"]
["DELETIONFLAG","FLOC","CHAR",null,null,null,null,null,null,"Flag for Deletion (Mark as 'X')"]
["NULL"]
["SORTFIELD","FLOC","CHAR",0,30,null,null,null,null,"ASSM Plate Number (Sort Field)"]
["SUPFLOC","FLOC","Pre-Populated",0,12,null,null,null,null,"Superior Functional Location","POLE01004994","CLMN09557866","PILL00411701","PILL00411702"]
["FLOC_CONST_D","FLOC","LIST",null,null,null,null,null,null,"FLOC Construction Type"]
["FLOC_TOT_D","FLOC","LIST",null,null,null,null,null,"LIST","FLOC Technical Object Type",null,null,"UG Termination","UG Termination"]
["MAINTLOC","FLOC","LIST",null,null,null,null,null,null,"Location","Kings Park Field ServiceCentre","Kings Park Field ServiceCentre","Kings Park Field ServiceCentre","Kings Park Field ServiceCentre"]
["ABCKZ","FLOC","LIST",null,null,null,null,null,null,"ABC Indicator","Outage Dependant Obj","Outage Dependant Obj","Outage Dependant Obj","Outage Dependant Obj"]
["NULL"]
["NULL",null,null,null,null,null,null,null,null,"Network General Characteristics"]
["URBAN","FLOC","LIST",0,3,null,null,null,null,"Urban"]
["NULL"]
["NULL",null,null,null,null,null,null,null,null,"FLOC Characteristics"]
["EQUIPMENT_OWNER","FLOC, EQ01","LIST",0,17,null,null,null,null,"Equipment Owner"]
["VOLTAGE_NOMINAL","FLOC, EQ01","LIST",0,999999,null,null,null,null,"Voltage - Nominal (V)"]
["NULL"]
["NULL",null,null,null,null,null,null,null,null,"Equipment Characteristics"]
["EQ_NUM","EQ01","Pre-Populated",null,null,null,null,"L",null,"Equipment Number"]
["REF_EQ_D","EQ01","ELIST","ASSM",null,null,null,null,null,"EQ Reference Equipment Desc"]
["EQ_TOT_D","EQ01","Pre-Populated",null,null,null,null,null,null,"EQ Technical Object Type"]
["DATECOMM","EQ01","DATE","1990-01-01","2100-12-31",null,null,null,null,"Commissioned Date (DD/MM/YYYY)"]
["PRO_REMV_STS","EQ01","CHAR",0,1,null,null,"L",null,"Proposed Removed"]
["PRO_REMV_EQ_NO","EQ01","Pre-Populated",null,null,null,null,"L",null,"Proposed Removed Equipment Number"]

{"sheet":"SLCP","index":16,"n_rows":36,"n_cols":10,"rows_kept":36,"cut":false,"hidden":false,"merged":[]}
["Source Code","Asset Type","Field","Min Value","Max Value","Field Entry","Default","Locked?",null,"SLCPs"]
["FLOC","FLOC","Pre-Populated",null,null,null,null,"L",null,"Functional Location"]
["REFLOC_D","FLOC","Pre-Populated",null,null,null,null,"L",null,"Reference Functional Location"]
["DELETIONFLAG","FLOC","CHAR",null,null,null,null,null,null,"Flag for Deletion (Mark as 'X')"]
["NULL"]
["SORTFIELD","FLOC","CHAR",0,30,null,null,null,null,"SLCP Plate Number (Sort Field)"]
["SUPFLOC","FLOC","Pre-Populated",0,12,null,null,"D",null,"Superior Functional Location"]
["FLOC_CONST_D","FLOC","LIST",null,null,null,null,"D",null,"FLOC Construction Type"]
["FLOC_TOT_D","FLOC","LIST",null,null,null,null,"D","SL_CTRLPT","FLOC Technical Object Type"]
["MAINTLOC","FLOC","LIST",null,null,null,null,"D",null,"Location"]
["ABCKZ","FLOC","LIST",null,null,null,null,null,null,"ABC Indicator"]
["NULL"]
["NULL",null,null,null,null,null,null,null,null,"Network General Characteristics"]
["URBAN","FLOC","LIST",0,3,null,null,null,null,"Urban"]
["NULL"]
["NULL",null,null,null,null,null,null,null,null,"FLOC Characteristics"]
["EQUIPMENT_OWNER","FLOC, EQ01","LIST",0,17,null,null,"D",null,"Equipment Owner"]
["NULL"]
["NULL",null,null,null,null,null,null,null,null,"Equipment Characteristics"]
["EQ_NUM","EQ01","Pre-Populated",null,null,null,null,"L",null,"Equipment Number"]
["REF_EQ_D","EQ01","ELIST","SLCP2",null,null,null,"D",null,"EQ Reference Equipment Desc"]
["EQ_TOT_D","EQ01","Pre-Populated",null,null,null,null,"D",null,"EQ Technical Object Type"]
["DATECOMM","EQ01","DATE","1990-01-01","2100-12-31",null,null,"D",null,"Commissioned Date (DD/MM/YYYY)"]
["NULL"]
["MANU","EQ01","CHAR",0,30,null,null,null,null,"Manufacturer"]
["MANUPARTNO","EQ01","CHAR",0,30,null,null,null,null,"Manufacturer Part No"]
["MANUSERNO","EQ01","CHAR",0,30,null,null,null,null,"Manufacturer Serial No"]
["MANUCOUNT","EQ01","LIST",0,2,null,null,null,null,"Manufacturer Country"]
["CONSTMONTH","EQ01","NUM",1,12,null,null,null,null,"Manufacturer Month"]
["CONSTYEAR","EQ01","NUM",1,9999,null,null,null,null,"Manufacturer Year"]
["NULL"]
["QUANTITY_OF_PHASES","EQ01","LIST",0,7,null,null,null,null,"Phase - Qty"]
["PRO_REMV_STS","EQ01","CHAR",0,1,null,null,"L",null,"Proposed Removed"]
["PRO_REMV_EQ_NO","EQ01","Pre-Populated",null,null,null,null,"L",null,"Proposed Removed Equipment Number"]
["NULL"]
[null,null,null,null,null,null,null,null,null,"Comments"]

{"sheet":"STREETLIGHT","index":17,"n_rows":55,"n_cols":11,"rows_kept":55,"cut":false,"hidden":false,"merged":[]}
["Source Code","Asset Type","Field","Min Value","Max Value","Field Entry","Default","Locked?",null,"Streetlights"]
["FLOC","FLOC","Pre-Populated",null,null,"M",null,"L",null,"Functional Location","SLGT00314229"]
["REFLOC_D","FLOC","Pre-Populated",null,null,null,null,"L",null,"Reference Functional Location","SLGTCLMN0001"]
["DELETIONFLAG","FLOC","CHAR",0,1,null,null,null,null,"Flag for Deletion (Mark as 'X')"]
["NULL"]
["SORTFIELD","FLOC","CHAR",0,30,null,null,null,null,"Streetlight Plate Number (Sort Field)","SL314229"]
["SUPFLOC","FLOC","Pre-Populated",0,12,null,null,null,null,"Superior Functional Location","CLMN09557866"]
["FLOC_CONST_D","FLOC","LIST",null,null,null,null,"D",null,"FLOC Construction Type"]
["FLOC_TOT_D","FLOC","Pre-Populated",null,null,null,"SL_STLGHT","D",null,"FLOC Technical Object Type"]
["MAINTLOC","FLOC","LIST",null,null,null,null,"D",null,"Location","Kings Park Field ServiceCentre"]
["ABCKZ","FLOC","LIST",null,null,null,null,null,null,"ABC Indicator","Outage Dependant Obj"]
["NULL"]
["NULL",null,null,null,null,null,null,null,null,"Network General Characteristics"]
["URBAN","FLOC","LIST",0,3,null,null,null,null,"Urban"]
["NULL"]
["NULL",null,null,null,null,null,null,null,null,"Streetlight Characteristics"]
["BILLING_CUSTOMER","FLOC","LIST",0,30,null,null,"D",null,"Billing Customer"]
["DATECOMM","FLOC","DATE","1990-01-01","2100-12-31",null,null,"C",null,"Commissioned Date (DD/MM/YYYY)"]
["COLUMN_FUNCTION","FLOC","LIST",0,21,null,null,null,null,"Column Function"]
["EQUIPMENT_OWNER","FLOC,EQ01,EQ02","LIST",0,17,null,null,"D",null,"Equipment Owner"]
["LOCATION_ZONE","FLOC","LIST",0,20,null,null,null,null,"Location Zone"]
["MAST_LENGTH","FLOC","DEC",0,99.9,null,null,null,null,"Mast Length (m)"]
["OUTREACH_LENGTH","FLOC","DEC",0,99.9,null,null,null,null,"Outreach Length (m)"]
["SL_CONTROL_TYPE","FLOC","LIST",0,30,null,null,null,null,"Streetlight Control Type"]
["SL_LUMINAIRE","FLOC, EQ02","LIST",0,6,"M",null,"D",null,"Streetlight Luminaire"]
["SL_TARIFF_CLASS","FLOC, EQ02","LIST",0,2,null,null,"D",null,"Streetlight Tariff Class"]
["SL_TARIFF_RATE","FLOC","CHAR",0,30,null,null,"L",null,"Streetlight Tariff Rate"]
["SLCP","FLOC","CHAR",0,8,null,null,null,null,"SLCP No"]
["UNMETERED_SUPPLY","FLOC","LIST",0,3,null,null,null,null,"Unmetered Supply"]
["NULL"]
["NULL",null,null,null,null,null,null,null,null,"Bracket/Outreach Characteristics"]
["EQ_NUM","EQ01","Pre-Populated",null,null,null,null,"L",null,"Equipment Number"]
["REF_EQ_D","EQ01","ELIST","STREETLIGHT",null,null,null,"W",null,"EQ Reference Equipment Desc","Gen, Streetlight Outreach"]
["EQ_TOT_D","EQ01","Pre-Populated",null,null,null,null,"W",null,"EQ Technical Object Type","Streetlight Outreach"]
["DATECOMM","EQ01","DATE","1990-01-01","2100-12-31",null,null,"W",null,"Commissioned Date (DD/MM/YYYY)"]
["HORIZ_SUPPORT_TARIFF","EQ01","LIST",0,3,null,null,"W",null,"Horiz. Support Tariff Class"]
["SL_HORIZ_SUPPORT","EQ01","LIST",0,6,null,null,"W",null,"Streetlight Horizontal Support"]
["SL_TARIFF_RATE","EQ01","CHAR",0,30,null,null,"W",null,"Streetlight Tariff Rate"]
["PRO_REMV_STS","EQ01","CHAR",0,1,null,null,"L",null,"Proposed Removed"]
["PRO_REMV_EQ_NO","EQ01","Pre-Populated",null,null,null,null,"L",null,"Proposed Removed Equipment Number"]
["NULL"]
["NULL",null,null,null,null,null,null,null,null,"Lantern Characteristics"]
["EQ_NUM","EQ02","Pre-Populated",null,null,null,null,"L",null,"Equipment Number"]
["REF_EQ_D","EQ02","ELIST","STLTR",null,null,null,"D",null,"EQ Reference Equipment Desc"]
["EQ_TOT_D","EQ02","Pre-Populated",null,null,null,null,"D","SL_LTRNSL","EQ Technical Object Type"]
["DATECOMM","EQ02","DATE","1990-01-01","2100-12-31",null,null,"C",null,"Commissioned Date (DD/MM/YYYY)"]
["ESR_NUMBER","EQ02","NUM",0,99,null,null,null,null,"ESR Number"]
["LANTERN_LOCALITY","EQ02","LIST",0,30,null,null,null,null,"Lantern Locality"]
["LANTERN_TYPE","EQ02","LIST",0,12,null,null,null,null,"Lantern Type"]
["MOUNTING","EQ02","LIST",0,12,null,null,null,null,"Mounting"]
["SL_SUBSIDY","EQ02","CHAR",0,6,null,null,null,null,"SL Subsidy No"]
["PRO_REMV_STS","EQ02","CHAR",0,1,null,null,"L",null,"Proposed Removed"]
["PRO_REMV_EQ_NO","EQ02","Pre-Populated",null,null,null,null,"L",null,"Proposed Removed Equipment Number"]
["NULL"]
[null,null,null,null,null,null,null,null,null,"Comments"]

{"sheet":"DSUB (GRND)","index":18,"n_rows":95,"n_cols":12,"rows_kept":95,"cut":false,"hidden":false,"merged":[]}
["Source Code","Asset Type","Field","Min Value","Max Value","Field Entry","Default","Locked?",null,"Substations"]
["FLOC","FLOC","Pre-Populated",null,null,"L",null,"L",null,"Functional Location","DSUB00097041","DSUB00097042"]
["REFLOC_D","FLOC","Pre-Populated",null,null,null,null,"L",null,"Reference Functional Location","DSUBDSUB0001","DSUBDSUB0001"]
["DELETIONFLAG","FLOC","CHAR",null,null,null,null,null,null,"Flag for Deletion (Mark as 'X')"]
["NULL"]
["SORTFIELD","FLOC","CHAR",0,30,null,null,null,null,"DSUB Plate Number (Sort Field)","DS97041","DS97042"]
["SUPFLOC","FLOC","Pre-Populated",0,12,null,null,null,null,"Superior Functional Location"]
["FLOC_CONST_D","FLOC","LIST",null,null,null,null,"D",null,"FLOC Construction Type"]
["FLOC_TOT_D","FLOC","FLIST","DSUB",null,"L",null,"D","LIST","FLOC Technical Object Type"]
["MAINTLOC","FLOC","LIST",null,null,null,null,"D",null,"Location","Kings Park Field ServiceCentre","Kings Park Field ServiceCentre"]
["ABCKZ","FLOC","LIST",null,null,null,null,null,null,"ABC Indicator","Outage Dependant Obj","Outage Dependant Obj"]
["NULL"]
["NULL",null,null,null,null,null,null,null,null,"Network General Characteristics"]
["URBAN","FLOC","LIST",0,3,null,null,null,null,"Urban"]
["NULL"]
["NULL",null,null,null,null,null,null,null,null,"FLOC Characteristics"]
["DATECOMM","FLOC","DATE","1990-01-01","2100-12-31",null,null,"C",null,"Commissioned Date (DD/MM/YYYY)"]
["AGREED_LOAD","FLOC","DEC2",0,999.99,null,null,null,null,"Agreed Supply Load (kVA)"]
["ASSIGNED_LOAD","FLOC","DEC2",0,99.99,null,null,null,null,"Assigned Load (kVA)"]
["DESIGN_COM_EARTH","FLOC","DEC2",0.01,99.99,null,null,null,null,"Designed COM Earth (Ohm)"]
["DESIGN_HV_EARTH","FLOC","DEC2",0.01,99.99,null,null,null,null,"Designed HV Earth (Ohm)"]
["DESIGN_LV_EARTH","FLOC","DEC2",0.01,99.99,null,null,null,null,"Designed LV Earth (Ohm)"]
["EARTH_COND_SIZE","FLOC","LIST",1,9999999,null,null,null,null,"Earthing Conductor Size (mm2)"]
["EARTH_CONFIGURATION","FLOC","LIST",1,20,null,null,null,null,"Earth Configuration"]
["EASEMENT_DP","FLOC","CHAR",0,30,null,null,null,null,"Easement/DP No"]
["EQUIPMENT_OWNER","FLOC","LIST",1,17,null,null,"D",null,"Equipment Owner"]
["INSTALLED_COM_EARTH","FLOC","DEC2",0,99.99,null,null,null,null,"Installed COM Earth (Ohm)"]
["INSTALLED_HV_EARTH","FLOC","DEC2",0,999.99,null,null,null,null,"Installed HV Earth (Ohm)"]
["INSTALLED_LV_EARTH","FLOC","DEC2",0,99.99,null,null,null,null,"Installed LV Earth (Ohm)"]
["LOAD_TYPE","FLOC","LIST",0,20,null,null,null,null,"Load Type"]
["QUANTITY_OF_PHASES","FLOC","LIST",1,7,null,null,null,null,"Phases"]
["VOLTAGE_NOMINAL","FLOC","LIST",1,999999,null,null,null,null,"Voltage - Nominal (V)"]
["DISTANCE_ROAD","FLOC","DEC2",0,99.99,"Sub1",null,null,null,"Distance from Road (m)"]
["EQUIPMENT_FUNCTION","FLOC","CHAR",1,30,"Sub1",null,null,null,"Equipment Function"]
["FORCED_VENTILATION","FLOC","CHAR",0,1,"Sub2",null,null,null,"Forced Ventilation"]
["SUB_FOOTING","FLOC","LIST",1,16,"Sub3",null,null,null,"Substation Footing"]
["SUMP_PUMP","FLOC","CHAR",0,1,"Sub2",null,null,null,"Sump Pump Installed? (Y/N)"]
["NULL"]
["NULL",null,null,null,null,null,null,null,"Indoor, Cottage, Ground","Fire Extinguisher Characteristics"]
["REF_EQ_D","EQ01","ELIST","DSUBGRNDFEX",null,"Sub4",null,null,"LIST","EQ Reference Equipment Desc"]
["EQ_TOT_D","EQ01","Pre-Populated",null,null,"Sub4",null,null,"FE_FEXTGH","EQ Technical Object Type"]
["QTY","EQ01","NUM",0,100,"Sub4",null,null,null,"Quantity"]
["DATECOMM","EQ01","DATE","1990-01-01","2100-12-31","Sub4",null,null,null,"Commissioned Date (DD/MM/YYYY)"]
["NULL"]
["NULL",null,null,null,null,null,null,null,"Indoor, Cottage, Ground","Fire Blanket Characteristics"]
["REF_EQ_D","EQ02","ELIST","DSUBGRNDFBD",null,"Sub4",null,null,"LIST","EQ Reference Equipment Desc"]
["EQ_TOT_D","EQ02","Pre-Populated",null,null,"Sub4",null,null,"FE_FBLDRY","EQ Technical Object Type"]
["DATECOMM","EQ02","DATE","1990-01-01","2100-12-31","Sub4",null,null,null,"Commissioned Date (DD/MM/YYYY)"]
["INSTALLED_BY","EQ02","CHAR",0,10,"Sub4",null,null,null,"Installed By"]
["QTY","EQ02","NUM",0,100,"Sub4",null,null,null,"Quantity"]
["NULL"]
["NULL",null,null,null,null,null,null,null,"Indoor, Cottage, Ground","Emergency Light Characteristics"]
["EQ_NUM","EQ03","Pre-Populated",null,null,"Sub4",null,null,null,"Equipment Number"]
["REF_EQ_D","EQ03","ELIST","DSUBGRNDEME",null,"Sub4",null,null,"LIST","EQ Reference Equipment Desc"]
["EQ_TOT_D","EQ03","Pre-Populated",null,null,"Sub4",null,null,"FE_EMEXLT","EQ Technical Object Type"]
["DATECOMM","EQ03","DATE","1990-01-01","2100-12-31","Sub4",null,null,null,"Commissioned Date (DD/MM/YYYY)"]
["INSTALLED_BY","EQ03","CHAR",0,10,"Sub4",null,null,null,"Installed By"]
["PRO_REMV_STS","EQ03","CHAR",0,1,"Sub4",null,"L",null,"Proposed Removed"]
["PRO_REMV_EQ_NO","EQ03","Pre-Populated",null,null,"Sub4",null,"L",null,"Proposed Removed Equipment Number"]
["NULL"]
["NULL",null,null,null,null,null,null,null,"Indoor, Cottage, Ground","Door Characteristics"]
["REF_EQ_D","EQ04","ELIST","DSUBGRNDRSTD",null,"Sub4",null,null,"LIST","EQ Reference Equipment Desc"]
["EQ_TOT_D","EQ04","Pre-Populated",null,null,"Sub4",null,null,"CV_DRSTD","EQ Technical Object Type"]
["DATECOMM","EQ04","DATE","1990-01-01","2100-12-31","Sub4",null,null,null,"Commissioned Date (DD/MM/YYYY)"]
["EQUIPMENT_OWNER","EQ04","LIST",1,17,"Sub4",null,null,"LIST","Equipment Owner"]
["QTY","EQ04","NUM",0,100,"Sub4",null,null,null,"Quantity"]
["NULL"]
["NULL",null,null,null,null,null,null,null,"Indoor, Cottage, Ground","Brick Enclosure Characteristics"]
["EQ_NUM","EQ05","Pre-Populated",null,null,"Sub4",null,null,null,"Equipment Number"]
["REF_EQ_D","EQ05","ELIST","DSUBGRNDBEN",null,"Sub4",null,null,"LIST","EQ Reference Equipment Desc"]
["EQ_TOT_D","EQ05","Pre-Populated",null,null,"Sub4",null,null,"CV_BRKENC","EQ Technical Object Type"]
["DATECOMM","EQ05","DATE","1990-01-01","2100-12-31","Sub4",null,null,null,"Commissioned Date (DD/MM/YYYY)"]
["BUILDING_TYPE","EQ05","LIST",0,20,"Sub4",null,null,"LIST","Building Type"]
["EQUIPMENT_OWNER","EQ05","LIST",1,17,"Sub4",null,null,"LIST","Equipment Owner"]
["PRO_REMV_STS","EQ05","CHAR",0,1,"Sub4",null,"L",null,"Proposed Removed"]
["PRO_REMV_EQ_NO","EQ05","Pre-Populated",null,null,"Sub4",null,"L",null,"Proposed Removed Equipment Number"]
["NULL"]
["NULL",null,null,null,null,null,null,null,"Cubicle Switch, Padmount","Cubicle Characteristics"]
["EQ_NUM","EQ06","Pre-Populated",null,null,"Sub5",null,null,null,"Equipment Number"]
["REF_EQ_D","EQ06","ELIST","DSUBGRNDCMCU",null,"Sub5",null,"D","LIST","EQ Reference Equipment Desc"]
["EQ_TOT_D","EQ06","Pre-Populated",null,null,"Sub5",null,"D","CV_CMPCUB","EQ Technical Object Type"]
["DATECOMM","EQ06","DATE","1990-01-01","2100-12-31","Sub5",null,null,null,"Commissioned Date (DD/MM/YYYY)"]
["BUILDING_TYPE","EQ06","LIST",0,20,"Sub5",null,null,"LIST","Building Type"]
["EQUIPMENT_OWNER","EQ06","LIST",1,17,"Sub5",null,null,"LIST","Equipment Owner"]
["PRO_REMV_STS","EQ06","CHAR",0,1,"Sub5",null,"L",null,"Proposed Removed"]
["PRO_REMV_EQ_NO","EQ06","Pre-Populated",null,null,"Sub5",null,"L",null,"Proposed Removed Equipment Number"]
["NULL"]
["NULL",null,null,null,null,null,null,null,"All Substation","Lock Characteristics"]
["REF_EQ_D","EQ07","ELIST","DSUBGRNDLK",null,null,null,null,"LIST","EQ Reference Equipment Desc"]
["EQ_TOT_D","EQ07","Pre-Populated",null,null,null,null,null,"LK_CYLNLK","EQ Technical Object Type"]
["DATECOMM","EQ07","DATE","1990-01-01","2100-12-31",null,null,null,null,"Commissioned Date (DD/MM/YYYY)"]
["LOCK","EQ07","LIST",0,18,null,null,null,"LIST","Lock"]
["QTY","EQ07","NUM",0,100,null,null,null,null,"Quantity"]
["NULL"]
[null,null,null,null,null,null,null,null,null,"Comments"]

{"sheet":"DSUB (POLE)","index":19,"n_rows":59,"n_cols":10,"rows_kept":59,"cut":false,"hidden":false,"merged":[]}
["Source Code","Asset Type","Field","Min Value","Max Value","Field Entry","Default","Locked?",null,"Substations"]
["FLOC","FLOC","Pre-Populated",null,null,null,null,"L",null,"Functional Location"]
["REFLOC_D","FLOC","Pre-Populated",null,null,null,null,"L",null,"Reference Functional Location"]
["DELETIONFLAG","FLOC","CHAR",null,null,null,null,null,null,"Flag for Deletion (Mark as 'X')"]
["NULL"]
["SORTFIELD","FLOC","CHAR",0,30,null,null,null,null,"DSUB Plate Number (Sort Field)"]
["SUPFLOC","FLOC","Pre-Populated",0,12,null,null,"D",null,"Superior Functional Location"]
["FLOC_CONST_D","FLOC","LIST",null,null,null,null,"D",null,"FLOC Construction Type"]
["FLOC_TOT_D","FLOC","FLIST","DSUB",null,null,null,"D","LIST","FLOC Technical Object Type"]
["MAINTLOC","FLOC","LIST",null,null,null,null,"D",null,"Location"]
["ABCKZ","FLOC","LIST",null,null,null,null,null,null,"ABC Indicator"]
["NULL"]
["NULL",null,null,null,null,null,null,null,null,"Network General Characteristics"]
["URBAN","FLOC","LIST",0,3,null,null,null,null,"Urban"]
["NULL"]
["NULL",null,null,null,null,null,null,null,null,"FLOC Characteristics"]
["AGREED_LOAD","FLOC","DEC2",0,999.99,null,null,null,null,"Agreed Supply Load (kVA)"]
["ASSIGNED_LOAD","FLOC","DEC2",0,99.99,null,null,null,null,"Assigned Load (kVA)"]
["CUSTOMER_METERBOX","FLOC","LIST",0,3,"Sub1",null,null,"LIST","Customer Meterbox on Sub Pole"]
["DESIGN_COM_EARTH","FLOC","DEC2",0,99.99,null,null,null,null,"Designed COM Earth (Ohm)"]
["DESIGN_HV_EARTH","FLOC","DEC2",0,99.99,null,null,null,null,"Designed HV Earth (Ohm)"]
["DESIGN_LV_EARTH","FLOC","DEC2",0,99.99,null,null,null,null,"Designed LV Earth (Ohm)"]
["DISTANCE_ROAD","FLOC","DEC2",0,99.99,"Sub1",null,null,null,"Distance from Road (m)"]
["EARTH_COND_SIZE","FLOC","LIST",0,9999999,null,null,null,"LIST","Earthing Conductor Size (mm2)"]
["EARTH_CONFIGURATION","FLOC","LIST",0,30,null,null,null,"LIST","Earth Configuration"]
["EASEMENT_DP","FLOC","CHAR",0,30,null,null,null,null,"Easement/DP No"]
["EQUIPMENT_FUNCTION","FLOC","CHAR",1,30,"Sub1",null,null,"LIST","Equipment Function"]
["EQUIPMENT_OWNER","FLOC","LIST",1,17,null,null,"D","LIST","Equipment Owner"]
["HANGING_BRKT_HT","FLOC","DEC2",0,9.99,null,null,null,null,"Hanging Bracket Height (m)"]
["HV_DROPPER_TYPE","FLOC","LIST",0,8,null,null,null,null,"HV Dropper Cable Type"]
["INSTALLED_COM_EARTH","FLOC","DEC2",0,99.99,null,null,null,null,"Installed COM Earth (Ohm)"]
["INSTALLED_HV_EARTH","FLOC","DEC2",0,999.99,null,null,null,null,"Installed HV Earth (Ohm)"]
["INSTALLED_LV_EARTH","FLOC","DEC2",0,99.99,null,null,null,null,"Installed LV Earth (Ohm)"]
["LIVELINE_BRIDGES","FLOC","LIST",0,20,null,null,null,null,"Live-Line Clamp Bridges"]
["LIVELINE_DISCONNECTORS","FLOC","LIST",0,3,null,null,null,null,"Live-Line Disconnects Fitted"]
["LOAD_TYPE","FLOC","LIST",0,20,null,null,"D","LIST","Load Type"]
["MDI_CONNECTION","FLOC","LIST",0,10,null,null,null,null,"MDI Connection"]
["PHASE_ROTATION","FLOC","LIST",0,8,null,null,null,null,"Phase Rotation"]
["QUANTITY_OF_PHASES","FLOC","LIST",1,7,null,null,"D","LIST","Phase - QTY"]
["SAFETY_CHAIN","FLOC","LIST",0,3,null,null,null,null,"Safety Chain Fitted"]
["TEMP_IND_DATE","FLOC","DATE","1990-01-01","9999-12-31",null,null,null,null,"Temp Indicator Installed (DD/MM/YYYY)"]
["VOLTAGE_NOMINAL","FLOC","LIST",1,999999,null,null,"D","LIST","Voltage - Nominal (V)"]
["NULL"]
["NULL",null,null,null,null,null,null,null,null,"Surge Diverter Characteristics"]
["EQ_NUM","EQ08","Pre-Populated",null,null,null,null,"L",null,"Equipment Number"]
["REF_EQ_D","EQ08","ELIST","DSUBPOLESRG",null,null,null,"D","LIST","EQ Reference Equipment Desc"]
["EQ_TOT_D","EQ08","Pre-Populated",null,null,null,null,"D","SE_SRGDIV","EQ Technical Object Type"]
["DATECOMM","EQ08","DATE","1990-01-01","9999-12-31",null,null,"C",null,"Commissioned Date (DD/MM/YYYY)"]
["RATING_VOLTS","EQ08","LIST",0,999999.99,null,null,"C","LIST","Voltage Rating"]
["SURGE_DIVERTER_LOCATION","EQ08","LIST",1,15,null,null,"C","LIST","Surge Diverter Location"]
["SURGE_DIVERTER_TYPE","EQ08","LIST",1,10,null,null,"C","LIST","Surge Diverter Type"]
["SURGE_DIVERTER_VENTED","EQ08","LIST",1,12,null,null,"C","LIST","Surge Diverter Vented"]
["MEASURED_COM_EARTH","EQ08","DEC2",0,99.99,null,null,null,null,"Measured Common Earth Resist (Ohm)"]
["MEASURED_HV_EARTH","EQ08","DEC2",0,99.99,null,null,null,null,"Measured HV Earth Resistance (Ohm)"]
["MEASURED_LV_EARTH","EQ08","DEC2",0,99.99,null,null,null,null,"Measured LV Earth Resistance (Ohm)"]
["PRO_REMV_STS","EQ08","CHAR",0,1,null,null,"L",null,"Proposed Removed"]
["PRO_REMV_EQ_NO","EQ08","Pre-Populated",null,null,null,null,"L",null,"Proposed Removed Equipment Number"]
["NULL"]
[null,null,null,null,null,null,null,null,null,"Comments"]

{"sheet":"SWITCHGEAR","index":20,"n_rows":54,"n_cols":14,"rows_kept":54,"cut":false,"hidden":false,"merged":[]}
["Source Code","Asset Type","Field","Min Value","Max Value","Field Entry","Default","Locked?",null,"Sub Switchgear"]
["FLOC","FLOC","Pre-Populated",null,null,null,null,"L",null,"Functional Location","LVDG00002916","HVDG00004016","BBLV00038807","BBHV00020874"]
["REFLOC_D","FLOC","Pre-Populated",null,null,null,null,"L",null,"Reference Functional Location","LVDGDSUB0001","HVDGDSUB0001","BBLVDSUB0001","BBHVDSUB0001"]
["DELETIONFLAG","FLOC","CHAR",null,null,null,null,null,null,"Flag for Deletion (Mark as 'X')"]
["NULL"]
["SORTFIELD","FLOC","CHAR",0,30,null,null,null,null,"SwitchGear Plate Number (Sort Field)"]
["SUPFLOC","FLOC","Pre-Populated",0,12,null,null,"D",null,"Superior Functional Location",null,null,"LVDG00002916","HVDG00004016"]
["FLOC_CONST_D","FLOC","LIST",null,null,null,null,"D",null,"FLOC Construction Type"]
["FLOC_TOT_D","FLOC","FLIST","SUBSWITCHES",null,null,null,"D",null,"FLOC Technical Object Type"]
["MAINTLOC","FLOC","LIST",null,null,null,null,"D",null,"Location","Kings Park Field ServiceCentre","Kings Park Field ServiceCentre","Kings Park Field ServiceCentre","Kings Park Field ServiceCentre"]
["ABCKZ","FLOC","LIST",null,null,null,null,null,null,"ABC Indicator","Outage Dependant Obj","Outage Dependant Obj","Outage Dependant Obj","Outage Dependant Obj"]
["NULL"]
["NULL",null,null,null,null,null,null,null,null,"Network General Characteristics"]
["URBAN","FLOC","LIST",0,3,null,null,null,null,"Urban"]
["NULL"]
["NULL",null,null,null,null,null,null,null,null,"FLOC Characteristics"]
["EQUIPMENT_OWNER","FLOC,EQ01","LIST",1,17,null,null,"D",null,"Equipment Owner"]
["VOLTAGE_NOMINAL","FLOC,EQ01","LIST",1,999999,null,null,"D",null,"Voltage Nominal (V)"]
["LV_SWITCHGEAR_CONFIG","FLOC","LIST",null,null,"SwLV",null,null,null,"LV Switchgear Config"]
["NULL"]
["NULL",null,null,null,null,null,null,null,null,"Equipment Characteristics"]
["EQ_NUM","EQ01","Pre-Populated",null,null,"noEQ",null,"L",null,"Equipment Number"]
["REF_EQ_D","EQ01","ELIST","SWITCHGEAR",null,"noEQ",null,"D",null,"EQ Reference Equipment Desc"]
["EQ_TOT_D","EQ01","Pre-Populated",null,null,"noEQ",null,"D",null,"EQ Technical Object Type"]
["DATECOMM","EQ01","DATE","1990-01-01","2100-12-31","noEQ",null,"C",null,"Commissioned Date (DD/MM/YYYY)"]
["NULL"]
["MANU","EQ01","CHAR",0,30,"noEQ",null,null,null,"Manufacturer"]
["MANUPARTNO","EQ01","CHAR",0,30,"noEQ",null,null,null,"Manufacturer Part No"]
["MANUSERNO","EQ01","CHAR",0,30,"noEQ",null,null,null,"Manufacturer Serial No"]
["MANUCOUNT","EQ01","LIST",0,2,"noEQ",null,null,null,"Manufacturer Country"]
["CONSTMONTH","EQ01","NUM",1,12,"noEQ",null,null,null,"Manufacturer Month"]
["CONSTYEAR","EQ01","NUM",1,9999,"noEQ",null,null,null,"Manufacturer Year"]
["NULL"]
["ARC_QUENCHING_MEDIUM","EQ01","LIST",1,20,"Sw3, noEQ",null,null,"LIST","Arc Quenching Medium"]
["CONTROL_METHOD","EQ01","LIST",1,7,"Sw2, Sw3",null,null,"LIST","Control Method"]
["CURRENT_RATING","EQ01","DEC2",0,999999.99,"Sw3, noEQ",null,"D",null,"Rating - Current (A)"]
["FAULT_RATE_TIME","EQ01","DEC2",0,99.99,"Sw2, Sw3",null,null,null,"Fault Rating Time (s)"]
["FAULT_RATING","EQ01","LIST",0,999.9,"Sw2, Sw3",null,null,"LIST","Fault Rating (kA)"]
["HEATER","EQ01","LIST",0,3,"Sw2, Sw3",null,null,"LIST","Heater Fitted"]
["HV_FUSE_ELEMENT","EQ01","LIST",0,999.99,"Sw1, Sw2, Sw3, Sw5",null,null,null,"Fuse Element (A)"]
["KRONE_3PH_OPERATION","EQ01","CHAR",0,1,"Sw1, Sw2, Sw3, Sw5",null,null,null,"Krone 3PH Operation"]
["QUANTITY_OF_PHASES","EQ01","LIST",0,7,"Sw3, Sw4, noEQ",null,null,"LIST","Phase - Qty"]
["RATING_FUSE","EQ01","DEC2",0,99.99,"Sw1, Sw2, Sw3, Sw5",null,null,null,"Fuse Rating (A)"]
["RATING_VOLTS","EQ01","LIST",0,999999.99,"Sw3, Sw4, noEQ",null,"D","LIST","Voltage Rating (V)"]
["SF6_QUANTITY","EQ01","DEC2",0,999.99,"Sw2, Sw3",null,null,null,"SF6 Gas Quantity (kg)"]
["SWITCHGEAR_CONFIG","EQ01","LIST",1,16,"Sw2, Sw3",null,null,"LIST","Switchgear Configuration"]
["TOTAL_MASS","EQ01","DEC2",0,9999.99,"Sw2, Sw3",null,null,null,"Mass - Total (kg)"]
["VOL_ARC_QUENCH","EQ01","DEC2",0,99.99,"Sw2, Sw3",null,null,null,"Arc Quench/Insulating Vol (l)"]
["VOLT_TRIP_CLOSE","EQ01","LIST",0,999999,"Sw2, Sw3",null,null,"LIST","Voltage - Trip/Close Coil (V)"]
["DISPOSAL_DATE","EQ01","DATE","1990-01-01","2100-12-31","Sw2, Sw3",null,null,null,"Disposal Date"]
["PRO_REMV_STS","EQ01","CHAR",0,1,"noEQ",null,"L",null,"Proposed Removed"]
["PRO_REMV_EQ_NO","EQ01","Pre-Populated",null,null,"noEQ",null,"L",null,"Proposed Removed Equipment Number"]
["NULL"]
[null,null,null,null,null,null,null,null,null,"Comments"]

{"sheet":"HV_LV Switches","index":21,"n_rows":90,"n_cols":18,"rows_kept":90,"cut":false,"hidden":false,"merged":[]}
["Source Code","Asset Type","Field","Min Value","Max Value","Field Entry","Default","Locked?",null,"HV/LV Switches"]
["FLOC","FLOC","Pre-Populated",null,null,null,null,"L",null,"Functional Location","DSSW00406722","DSSW00406723","SWIT00245862","SWIT00245863","SWIT00245864","SWIT00245865","SWIT00245866","SWIT00245867"]
["REFLOC_D","FLOC","Pre-Populated",null,null,null,null,"L",null,"Reference Functional Location","DSSWDSUB0001","DSSWDSUB0002","SWITDSUB0001","SWITDSUB0001","SWITDSUB0002","SWITDSUB0002","SWITDSUB0002","SWITDSUB0002"]
["DELETIONFLAG","FLOC","CHAR",null,null,null,null,null,null,"Flag for Deletion (Mark as 'X')"]
["NULL"]
["SORTFIELD","FLOC","CHAR",0,30,null,null,null,null,"Switch Plate Number (Sort Field)"]
["SUPFLOC","FLOC","Pre-Populated",0,12,null,null,"D",null,"Superior Functional Location","HVDG00004016","LVDG00002916","HVDG00004016","HVDG00004016","LVDG00002916","LVDG00002916","LVDG00002916","LVDG00002916"]
["FLOC_CONST_D","FLOC","LIST",null,null,null,null,"D",null,"FLOC Construction Type"]
["FLOC_TOT_D","FLOC","FLIST","HVSWITCHES",null,null,null,"D","LIST","FLOC Technical Object Type"]
["MAINTLOC","FLOC","LIST",null,null,null,null,"D",null,"Location","Kings Park Field ServiceCentre","Kings Park Field ServiceCentre","Kings Park Field ServiceCentre","Kings Park Field ServiceCentre","Kings Park Field ServiceCentre","Kings Park Field ServiceCentre","Kings Park Field ServiceCentre","Kings Park Field ServiceCentre"]
["ABCKZ","FLOC","LIST",null,null,null,null,null,null,"ABC Indicator","Outage Dependant Obj","Outage Dependant Obj","Outage Dependant Obj","Outage Dependant Obj","Outage Dependant Obj","Outage Dependant Obj","Outage Dependant Obj","Outage Dependant Obj"]
["NULL"]
["NULL",null,null,null,null,null,null,null,null,"Network General Characteristics"]
["URBAN","FLOC","LIST",0,3,null,null,null,"LIST","Urban"]
["NULL"]
["NULL",null,null,null,null,null,null,null,null,"FLOC Characteristics"]
["EQUIPMENT_OWNER","FLOC,EQ01","LIST",1,17,null,null,"D","LIST","Equipment Owner"]
["VOLTAGE_NOMINAL","FLOC,EQ01","LIST",1,999999,null,null,"D","LIST","Voltage Nominal (V)"]
["NULL"]
["NULL",null,null,null,null,null,null,null,null,"Equipment Characteristics"]
["EQ_NUM","EQ01","Pre-Populated",null,null,"noEQ",null,"L",null,"Equipment Number"]
["REF_EQ_D","EQ01","ELIST","HVSWITCHES",null,"noEQ",null,"D","LIST","EQ Reference Equipment Desc"]
["EQ_TOT_D","EQ01","Pre-Populated",null,null,"noEQ",null,"D","LIST","EQ Technical Object Type"]
["DATECOMM","EQ01","DATE","1990-01-01","2100-12-31","noEQ",null,"C",null,"Commissioned Date (DD/MM/YYYY)"]
["NULL"]
["MANU","EQ01","CHAR",0,30,"noEQ",null,null,null,"Manufacturer"]
["MANUPARTNO","EQ01","CHAR",0,30,"noEQ",null,null,null,"Manufacturer Part No"]
["MANUSERNO","EQ01","CHAR",0,30,"noEQ",null,null,null,"Manufacturer Serial No"]
["MANUCOUNT","EQ01","LIST",0,2,"noEQ",null,null,null,"Manufacturer Country"]
["CONSTMONTH","EQ01","NUM",1,12,"noEQ",null,null,null,"Manufacturer Month"]
["CONSTYEAR","EQ01","NUM",1,9999,"noEQ",null,null,null,"Manufacturer Year"]
["NULL"]
["ARC_QUENCHING_MEDIUM","EQ01","LIST",1,20,"noEQ, hv3, hv4,hv5, hv6, hv7, hv9, hvX, hvDF",null,"W","LIST","Arc Quenching Medium"]
["CONTROL_METHOD","EQ01","LIST",1,7,"noEQ, hv8, hvX",null,"W","LIST","Control Method"]
["CURRENT_RATING","EQ01","DEC2",0,999999.99,"noEQ, hv4, hv5",null,"W",null,"Rating - Current (A)"]
["EQUIPMENT_FUNCTION","EQ01","LIST",0,30,"noEQ, hv8, hvX",null,null,null,"Equipment Function"]
["FUSE_TYPE","EQ01","LIST",0,6,"noEQ, hv3, hv4, hv5, hv7, hv8, hvX",null,null,"LIST","Fuse Type"]
["HV_FUSE_ELEMENT","EQ01","LIST",0,999.99,"noEQ, hv3, hv4, hv5, hv7, hv8, hvX",null,null,null,"Fuse Element (A)"]
["INTERRUPTER","EQ01","CHAR",0,30,"rec",null,null,null,"Recloser/Sect Interrupter"]
["OP_HANDLE_LOCATION","EQ01","LIST",0,9,"oph",null,null,"LIST","Operating Handle Location"]
["QUANTITY_OF_PHASES","EQ01","LIST",0,7,"noEQ",null,"W","LIST","Phase - Qty"]
["RATING_VOLTS","EQ01","LIST",0,999999.99,"noEQ, hv3, hv4, hv5, hv6, hv7",null,"W","LIST","Voltage Rating (V)"]
["SW_CURRENT_RATING","EQ01","DEC2",0,99.99,"noEQ, hv8, hvX",null,null,null,"Switch Current Rating (A)"]
["PRO_REMV_STS","EQ01","CHAR",0,1,"noEQ",null,"L",null,"Proposed Removed"]
["PRO_REMV_EQ_NO","EQ01","Pre-Populated",null,null,"noEQ",null,"L",null,"Proposed Removed Equipment Number"]
["NULL"]
["NULL",null,null,null,null,null,null,null,"only Load Break, Recloser, Sectionaliser","Controller Characteristics"]
["EQ_NUM","EQ02","Pre-Populated",null,null,"hv1",null,"L",null,"Equipment Number"]
["REF_EQ_D","EQ02","ELIST","CTRL",null,"hv1",null,"D",null,"EQ Reference Equipment Desc"]
["EQ_TOT_D","EQ02","Pre-Populated",null,null,"hv1",null,"D","CM_SWCTRL","EQ Technical Object Type"]
["DATECOMM","EQ02","DATE","1990-01-01","2100-12-31","hv1",null,"C",null,"Commissioned Date (DD/MM/YYYY)"]
["DATE_INSTALLED","EQ02","DATE","1990-01-01","2100-12-31","hv1",null,null,null,"Date Installed"]
["PRO_REMV_STS","EQ02","CHAR",0,1,"hv1",null,"L",null,"Proposed Removed"]
["PRO_REMV_EQ_NO","EQ02","Pre-Populated",null,null,"hv1",null,"L",null,"Proposed Removed Equipment Number"]
["NULL"]
["NULL",null,null,null,null,null,null,null,"only Load Break, Recloser, Sectionaliser","Radio Characteristics"]
["EQ_NUM","EQ03","Pre-Populated",null,null,"hv1",null,"L",null,"Equipment Number"]
["REF_EQ_D","EQ03","ELIST","RAD",null,"hv1",null,"D",null,"EQ Reference Equipment Desc"]
["EQ_TOT_D","EQ03","Pre-Populated",null,null,"hv1",null,"D","CM_SWRAD","EQ Technical Object Type"]
["DATECOMM","EQ03","DATE","1990-01-01","2100-12-31","hv1",null,"C",null,"Commissioned Date (DD/MM/YYYY)"]
["DATE_INSTALLED","EQ03","DATE","1990-01-01","2100-12-31","hv1",null,null,null,"Date Installed"]
["PRO_REMV_STS","EQ03","CHAR",0,1,"hv1",null,"L",null,"Proposed Removed"]
["PRO_REMV_EQ_NO","EQ03","Pre-Populated",null,null,"hv1",null,"L",null,"Proposed Removed Equipment Number"]
["NULL"]
["NULL",null,null,null,null,null,null,null,"only Load Break, Recloser, Sectionaliser","VT Characteristics"]
["EQ_NUM","EQ04","Pre-Populated",null,null,"hv1",null,"L",null,"Equipment Number"]
["REF_EQ_D","EQ04","ELIST","VT",null,"hv1",null,"D",null,"EQ Reference Equipment Desc"]
["EQ_TOT_D","EQ04","Pre-Populated",null,null,"hv1",null,"D","VT_VTSW","EQ Technical Object Type"]
["DATECOMM","EQ04","DATE","1990-01-01","2100-12-31","hv1",null,"D",null,"Commissioned Date (DD/MM/YYYY)"]
["CLASS_VT","EQ04","CHAR",0,20,"hv1",null,null,null,"Class - VT"]
["INSULATING_MEDIUM","EQ04","LIST",0,12,"hv1",null,null,"LIST","Insulating Medium"]
["OIL_VOLUME","EQ04","DEC2",0,999.99,"hv1",null,null,null,"Oil or other insulating Vol (l)"]
["PHASE_CONNECTION","EQ04","LIST",0,16,"hv1",null,null,"LIST","Phase Connection"]
["RATING_PRIMARY","EQ04","NUM",0,999999,"hv1",null,null,null,"Voltage Rating (Primary) (V)"]
["RATING_SECONDARY","EQ04","NUM",0,999999,"hv1",null,null,null,"Voltage Rating (Secondary) (V)"]
["TOTAL_MASS","EQ04","DEC2",0,9999.99,"hv1",null,null,null,"Mass - Total (kg)"]
["VOLTAGE_NOMINAL","EQ04","LIST",0,999999,"hv1",null,null,"LIST","Voltage Nominal (V)"]
["PRO_REMV_STS","EQ04","CHAR",0,1,"hv1",null,"L",null,"Proposed Removed"]
["PRO_REMV_EQ_NO","EQ04","Pre-Populated",null,null,"hv1",null,"L",null,"Proposed Removed Equipment Number"]
["NULL"]
["NULL",null,null,null,null,null,null,null,"only Air Break","Lock Characteristics"]
["EQ_NUM","EQ05","Pre-Populated",null,null,"hv2",null,"L",null,"Equipment Number"]
["REF_EQ_D","EQ05","ELIST","LOCKB",null,"hv2",null,"D",null,"EQ Reference Equipment Desc"]
["EQ_TOT_D","EQ05","Pre-Populated",null,null,"hv2",null,"D","LK_PADLK","EQ Technical Object Type"]
["DATECOMM","EQ05","DATE","1990-01-01","2100-12-31","hv2",null,"C",null,"Commissioned Date (DD/MM/YYYY)"]
["LOCK","EQ05","LIST",0,18,"hv2",null,null,"LIST","Lock"]
["PRO_REMV_STS","EQ05","CHAR",0,1,"hv2",null,"L",null,"Proposed Removed"]
["PRO_REMV_EQ_NO","EQ05","Pre-Populated",null,null,"hv2",null,"L",null,"Proposed Removed Equipment Number"]
["NULL"]
[null,null,null,null,null,null,null,null,null,"Comments"]

{"sheet":"TRANSFORMER","index":22,"n_rows":86,"n_cols":11,"rows_kept":86,"cut":false,"hidden":false,"merged":[]}
["Source Code","Asset Type","Field","Min Value","Max Value","Field Entry","Default","Locked?",null,"Transformers"]
["FLOC","FLOC","Pre-Populated",null,null,null,null,"L",null,"Functional Location","DSTX10005756"]
["REFLOC_D","FLOC","Pre-Populated",null,null,null,null,"L",null,"Reference Functional Location","DSTXDSUB0001"]
["DELETIONFLAG","FLOC","CHAR",null,null,null,null,null,null,"Flag for Deletion (Mark as 'X')"]
["NULL"]
["SORTFIELD","FLOC","CHAR",0,30,null,null,null,null,"Transformer Plate Number (Sort Field)"]
["SUPFLOC","FLOC","Pre-Populated",0,12,null,null,"D",null,"Superior Functional Location","DSUB00097042"]
["FLOC_CONST_D","FLOC","LIST",null,null,null,null,"D",null,"FLOC Construction Type"]
["FLOC_TOT_D","FLOC","Pre-Populated",null,null,null,null,"D",null,"FLOC Technical Object Type"]
["MAINTLOC","FLOC","LIST",null,null,null,null,"D",null,"Location","Kings Park Field ServiceCentre"]
["ABCKZ","FLOC","LIST",null,null,null,null,null,null,"ABC Indicator","Outage Dependant Obj"]
["NULL"]
["NULL",null,null,null,null,null,null,null,null,"Network General Characteristics"]
["URBAN","FLOC","LIST",0,3,null,null,null,null,"Urban"]
["NULL"]
["NULL",null,null,null,null,null,null,null,null,"FLOC Characteristics"]
["TAP_VOLTAGE","FLOC","DEC2",0,9999.99,"TRF1",null,null,"All except Auto","Current Tap Voltage (V)"]
["KVA_RATING","FLOC","LIST",0,999999,"TRF1",null,"D","All except Auto","KVA Rating (kVA)"]
["QUANTITY_OF_PHASES","FLOC","LIST",0,7,"TRF1",null,"D","All except Auto","Phase - Qty"]
["TFR_LOAD_TYPE","FLOC","LIST",0,18,"TRF1",null,null,"All except Auto","Transformer Load Type"]
["VOLTAGE_NOMINAL","FLOC","LIST",0,999999,null,null,null,null,"Voltage - Nominal (V)"]
["NULL"]
["NULL",null,null,null,null,null,null,null,null,"Equipment Characteristics"]
["EQ_NUM","EQ01","Pre-Populated",null,null,null,null,"L",null,"Equipment Number"]
["REF_EQ_D","EQ01","ELIST","TRANSFORMER",null,null,null,"D",null,"EQ Reference Equipment Desc"]
["EQ_TOT_D","EQ01","Pre-Populated",null,null,null,null,"D",null,"EQ Technical Object Type"]
["DATECOMM","EQ01","DATE","1990-01-01","9999-12-31",null,null,"C",null,"Commissioned Date (DD/MM/YYYY)"]
["NULL"]
["MANU","EQ01","CHAR",0,30,null,null,"C",null,"Manufacturer"]
["MANUPARTNO","EQ01","CHAR",0,30,null,null,"C",null,"Manufacturer Part No"]
["MANUSERNO","EQ01","CHAR",0,30,null,null,"C",null,"Manufacturer Serial No"]
["MANUCOUNT","EQ01","LIST",0,2,null,null,null,null,"Manufacturer Country"]
["CONSTMONTH","EQ01","NUM",1,12,null,null,null,null,"Manufacturer Month"]
["CONSTYEAR","EQ01","NUM",1,9999,null,null,null,null,"Manufacturer Year"]
["NULL"]
["BRACKET_HEIGHT","EQ01","NUM",0,999999,"TRF2",null,null,"Voltage Reg Only","Bracket Height (m)"]
["BREATHER_TYPE","EQ01","LIST",1,22,null,null,null,"All Type","Breather Type"]
["CLASS_CT","EQ01","LIST",0,7,"TRF1",null,null,"All except Auto","Class - CT"]
["COOLING_TYPE","EQ01","LIST",0,7,"TRF1",null,null,"All except Auto","Cooling Type"]
["CORE_TYPE","EQ01","LIST",0,10,"TRF1",null,null,"All except Auto","Core Type"]
["CT_BURDEN","EQ01","DEC2",0,999.99,"TRF1",null,null,"All except Auto","CT Burden (VA)"]
["CT_POSITION","EQ01","LIST",1,8,"TRF1",null,null,"All except Auto","CT Position"]
["CT_RATIO_PRIMARY","EQ01","NUM",0,999999,"TRF1",null,null,"All except Auto","CT Primary (EA)"]
["CT_RATIO_SECONDARY","EQ01","NUM",0,999999,"TRF1",null,null,"All except Auto","CT Secondary (EA)"]
["HARMONICS_3RD","EQ01","DEC2",0,9999.99,"TRF1",null,null,"All except Auto","Harmonics 3rd (HZ)"]
["HARMONICS_5TH","EQ01","DEC2",0,9999.99,"TRF1",null,null,"All except Auto","Harmonics 5th (HZ)"]
["HARMONICS_7TH","EQ01","DEC2",0,9999.99,"TRF1",null,null,"All except Auto","Harmonics 7th (HZ)"]
["HEIGHT","EQ01","NUM",0,999999,"TRF1",null,null,"All except Auto","Height (m)"]
["HV_BUSHING_LOCATION","EQ01","LIST",0,7,"TRF1",null,null,"All except Auto","HV Bushing Location"]
["HV_BUSH_TYPE","EQ01","LIST",0,12,"TRF1",null,null,"All except Auto","HV Bushing Type"]
["INSULATING_MEDIUM","EQ01","LIST",0,12,"TRF1",null,"C","All except Auto","Insulating Medium"]
["KVA_RATING","EQ01","LIST",0,999999,"TRF1",null,"D","All except Auto","KVA Rating"]
["LENGTH","EQ01","DEC",0,999999999.89999998,"TRF1",null,null,"All except Auto","Length (m)"]
["LOSS_LOAD","EQ01","DEC2",0,9999.99,"TRF1",null,null,"All except Auto","Load Loss (W)"]
["MASS_CORE","EQ01","DEC2",0,9999.99,null,null,null,"All Type","Mass - Core & Coils (kg)"]
["MASS_OIL","EQ01","DEC2",0,9999.99,null,null,null,"All Type","Mass - Oil (kg)"]
["MASS_STRIPPED","EQ01","DEC2",0,9999.99,"TRF1",null,null,"All except Auto","Mass - Stripped (kg)"]
["MASS_TANK","EQ01","DEC2",0,9999.99,"TRF1",null,null,"All except Auto","Mass - Tank (kg)"]
["TOTAL_MASS","EQ01","DEC2",0,9999.99,null,null,"C","All Type","Mass - Total (kg)"]
["NOISE_LEVEL_LOW","EQ01","NUM",0,9,"TRF1",null,null,"All except Auto","Noise - Lower Level (dB(A))"]
["OIL_VOLUME","EQ01","DEC2",0,999.99,null,null,null,"All Type","Oil or other insulating Vol (l)"]
["OIL_SPEC","EQ01","LIST",0,8,"TRF1",null,null,"All except Auto","Oil Specification"]
["TANK_SURFACE","EQ01","LIST",0,9,"TRF1",null,null,"All except Auto","Surface Finish of Tank"]
["SURGE_DIV_FITMENT","EQ01","LIST",0,12,"TRF1",null,null,"All except Auto","Surge Diverted Fitment"]
["TAP_GROUP","EQ01","LIST",0,2,"TRF1",null,null,"All except Auto","Tap Group"]
["TAP_SETTING","EQ01","CHAR",0,3,"TRF1",null,null,"All except Auto","Tap Setting Code"]
["TAP_SET_DATE","EQ01","DATE","1990-01-01","9999-12-31","TRF1",null,null,"All except Auto","Tap Setting Date (DD/MM/YYYY)"]
["TEMP_IND_DATE","EQ01","DATE","1990-01-01","9999-12-31","TRF1",null,null,"All except Auto","Temp Indicator Installed (DD/MM/YYYY)"]
["TEMP_IND_CAT","EQ01","CHAR",0,1,"TRF1",null,null,"All except Auto","Temperature Indicator"]
["TFR_SPEC","EQ01","CHAR",0,30,"TRF1",null,null,"All except Auto","TFR Specification No"]
["TFR_RATIO_PRIMARY","EQ01","NUM",0,999999,"TRF1",null,null,"All except Auto","Transf Ratio - Primary (EA)"]
["TFR_RATIO_SECONDARY","EQ01","CHAR",0,6,"TRF1",null,null,"All except Auto","Transf Ratio - Secondary"]
["TFR_HV_CONNECT_TYPE","EQ01","LIST",0,10,"TRF1",null,null,"All except Auto","Transformer HV Connection Type"]
["TFR_LOAD_TYPE","EQ01","LIST",0,18,"TRF2",null,null,"Voltage Reg Only","Transformer Load Type"]
["INHITYPE","EQ01","CHAR",0,20,"TRF3",null,null,"Auto only","Type of inhibiter"]
["VECTOR_GROUP","EQ01","LIST",1,20,null,null,"C","All Type","Vector Group"]
["VOLTAGE_NOMINAL","EQ01","LIST",0,999999.99,null,null,"C","All Type","Voltage - Nominal (V)"]
["RATING_VOLTS","EQ01","LIST",0,999999.99,"TRF1",null,null,"All except Auto","Voltage Rating (V)"]
["RATING_PRIMARY","EQ01","NUM",0,999999,null,null,"C","All Type","Voltage Rating (Primary) (V)"]
["RATING_SECONDARY","EQ01","NUM",0,999999,null,null,"C","All Type","Voltage Rating (Secondary) (V)"]
["WIDTH","EQ01","NUM",0,999999,"TRF1",null,null,"All except Auto","Width (mm)"]
["Z_IMPEDANCE","EQ01","DEC3",0,99.998999999999995,"TRF1",null,null,"All except Auto","Z Impedance (%) Nominal Tap (Ohm)"]
["PRO_REMV_STS","EQ01","CHAR",0,1,null,null,"L","All Type","Proposed Removed"]
["PRO_REMV_EQ_NO","EQ01","Pre-Populated",null,null,null,null,"L","All Type","Proposed Removed Equipment Number"]
["NULL"]
[null,null,null,null,null,null,null,null,null,"Comments"]

{"sheet":"Errors","index":23,"n_rows":244,"n_cols":3,"rows_kept":244,"cut":false,"hidden":false,"merged":[]}
["Sheet Name","Cell","Message"]
["POLE","K8","Error: FLOC Construction Type is required for design phase"]
["POLE","K18","Error: Equipment Owner is required for design phase"]
["POLE","K24","Error: Special Use Code is required for design phase"]
["POLE","K29","Error: EQ Reference Equipment Desc is required for design phase"]
["POLE","K30","Error: EQ Technical Object Type is required for design phase"]
["POLE","K59","Error: FLOC Construction Type is required for design phase"]
["POLE","K60","Error: FLOC Technical Object Type is required for design phase"]
["POLE","K68","Error: Equipment Owner is required for design phase"]
["POLE","K73","Error: EQ Reference Equipment Desc is required for design phase"]
["POLE","K74","Error: EQ Technical Object Type is required for design phase"]
["COLUMN","K8","Error: FLOC Construction Type is required for design phase"]
["COLUMN","K9","Error: Technical Object Type is required for design phase"]
["COLUMN","K19","Error: Equipment Owner is required for design phase"]
["COLUMN","K25","Error: EQ Reference Equipment Desc is required for design phase"]
["COLUMN","K26","Error: EQ Technical Object Type is required for design phase"]
["COLUMN","K27","Error: Streetlight Vertical Support is required for design phase"]
["COLUMN","K28","Error: Streetlight Tariff Class is required for design phase"]
["COLUMN","K54","Error: FLOC Construction Type is required for design phase"]
["COLUMN","K55","Error: FLOC Technical Object Type is required for design phase"]
["COLUMN","K63","Error: Equipment Owner is required for design phase"]
["COLUMN","K68","Error: EQ Reference Equipment Desc is required for design phase"]
["COLUMN","K69","Error: EQ Technical Object Type is required for design phase"]
["PILLAR","K8","Error: FLOC Construction Type is required for design phase"]
["PILLAR","L8","Error: FLOC Construction Type is required for design phase"]
["PILLAR","K18","Error: Equipment Owner is required for design phase"]
["PILLAR","L18","Error: Equipment Owner is required for design phase"]
["PILLAR","K25","Error: EQ Reference Equipment Desc is required for design phase"]
["PILLAR","L25","Error: EQ Reference Equipment Desc is required for design phase"]
["PILLAR","K26","Error: EQ Technical Object Type is required for design phase"]
["PILLAR","L26","Error: EQ Technical Object Type is required for design phase"]
["PILLAR","K50","Error: FLOC Construction Type is required for design phase"]
["PILLAR","L50","Error: FLOC Construction Type is required for design phase"]
["PILLAR","K64","Error: EQ Reference Equipment Desc is required for design phase"]
["PILLAR","L64","Error: EQ Reference Equipment Desc is required for design phase"]
["PILLAR","K65","Error: EQ Technical Object Type is required for design phase"]
["PILLAR","L65","Error: EQ Technical Object Type is required for design phase"]
["STREETLIGHT","K8","Error: FLOC Construction Type is required for design phase"]
["STREETLIGHT","K9","Error: FLOC Technical Object Type is required for design phase"]
["STREETLIGHT","K17","Error: Billing Customer is required for design phase"]
["STREETLIGHT","K20","Error: Equipment Owner is required for design phase"]
["STREETLIGHT","K25","Error: Streetlight Luminaire is required for design phase"]
["STREETLIGHT","K26","Error: Streetlight Tariff Class is required for design phase"]
["STREETLIGHT","K35","Warning: Commissioned Date (DD/MM/YYYY) is missing"]
["STREETLIGHT","K36","Warning: Horiz. Support Tariff Class is missing"]
["STREETLIGHT","K37","Warning: Streetlight Horizontal Support is missing"]
["STREETLIGHT","K38","Warning: Streetlight Tariff Rate is missing"]
["STREETLIGHT","K44","Error: EQ Reference Equipment Desc is required for design phase"]
["STREETLIGHT","K45","Error: EQ Technical Object Type is required for design phase"]
["DSUB (GRND)","L8","Error: FLOC Construction Type is required for design phase"]
["DSUB (GRND)","L9","Error: FLOC Technical Object Type is required for design phase"]
["DSUB (GRND)","L26","Error: Equipment Owner is required for design phase"]
["DSUB (GRND)","K80","Error: EQ Reference Equipment Desc is required for design phase"]
["DSUB (GRND)","L80","Error: EQ Reference Equipment Desc is required for design phase"]
["DSUB (GRND)","K81","Error: EQ Technical Object Type is required for design phase"]
["DSUB (GRND)","L81","Error: EQ Technical Object Type is required for design phase"]
["SWITCHGEAR","K7","Error: Superior Functional Location is required for design phase"]
["SWITCHGEAR","L7","Error: Superior Functional Location is required for design phase"]
["SWITCHGEAR","K8","Error: FLOC Construction Type is required for design phase"]
["SWITCHGEAR","L8","Error: FLOC Construction Type is required for design phase"]
["SWITCHGEAR","K9","Error: FLOC Technical Object Type is required for design phase"]
["SWITCHGEAR","L9","Error: FLOC Technical Object Type is required for design phase"]
["SWITCHGEAR","K17","Error: Equipment Owner is required for design phase"]
["SWITCHGEAR","L17","Error: Equipment Owner is required for design phase"]
["SWITCHGEAR","K18","Error: Voltage Nominal (V) is required for design phase"]
["SWITCHGEAR","L18","Error: Voltage Nominal (V) is required for design phase"]
["SWITCHGEAR","M18","Error: Voltage Nominal (V) is required for design phase"]
["SWITCHGEAR","N18","Error: Voltage Nominal (V) is required for design phase"]
["SWITCHGEAR","K23","Error: EQ Reference Equipment Desc is required for design phase"]
["SWITCHGEAR","L23","Error: EQ Reference Equipment Desc is required for design phase"]
["SWITCHGEAR","K24","Error: EQ Technical Object Type is required for design phase"]
["SWITCHGEAR","L24","Error: EQ Technical Object Type is required for design phase"]
["SWITCHGEAR","K36","Error: Rating - Current (A) is required for design phase"]
["SWITCHGEAR","L36","Error: Rating - Current (A) is required for design phase"]
["SWITCHGEAR","M36","Error: Rating - Current (A) is required for design phase"]
["SWITCHGEAR","N36","Error: Rating - Current (A) is required for design phase"]
["SWITCHGEAR","K44","Error: Voltage Rating (V) is required for design phase"]
["SWITCHGEAR","L44","Error: Voltage Rating (V) is required for design phase"]
["SWITCHGEAR","M44","Error: Voltage Rating (V) is required for design phase"]
["SWITCHGEAR","N44","Error: Voltage Rating (V) is required for design phase"]
["HV_LV Switches","L8","Error: FLOC Construction Type is required for design phase"]
["HV_LV Switches","M8","Error: FLOC Construction Type is required for design phase"]
["HV_LV Switches","N8","Error: FLOC Construction Type is required for design phase"]
["HV_LV Switches","O8","Error: FLOC Construction Type is required for design phase"]
["HV_LV Switches","P8","Error: FLOC Construction Type is required for design phase"]
["HV_LV Switches","Q8","Error: FLOC Construction Type is required for design phase"]
["HV_LV Switches","R8","Error: FLOC Construction Type is required for design phase"]
["HV_LV Switches","L9","Error: FLOC Technical Object Type is required for design phase"]
["HV_LV Switches","M9","Error: FLOC Technical Object Type is required for design phase"]
["HV_LV Switches","N9","Error: FLOC Technical Object Type is required for design phase"]
["HV_LV Switches","O9","Error: FLOC Technical Object Type is required for design phase"]
["HV_LV Switches","P9","Error: FLOC Technical Object Type is required for design phase"]
["HV_LV Switches","Q9","Error: FLOC Technical Object Type is required for design phase"]
["HV_LV Switches","R9","Error: FLOC Technical Object Type is required for design phase"]
["HV_LV Switches","L17","Error: Equipment Owner is required for design phase"]
["HV_LV Switches","M17","Error: Equipment Owner is required for design phase"]
["HV_LV Switches","N17","Error: Equipment Owner is required for design phase"]
["HV_LV Switches","O17","Error: Equipment Owner is required for design phase"]
["HV_LV Switches","P17","Error: Equipment Owner is required for design phase"]
["HV_LV Switches","Q17","Error: Equipment Owner is required for design phase"]
["HV_LV Switches","R17","Error: Equipment Owner is required for design phase"]
["HV_LV Switches","K18","Error: Voltage Nominal (V) is required for design phase"]
["HV_LV Switches","L18","Error: Voltage Nominal (V) is required for design phase"]
["HV_LV Switches","M18","Error: Voltage Nominal (V) is required for design phase"]
["HV_LV Switches","N18","Error: Voltage Nominal (V) is required for design phase"]
["HV_LV Switches","O18","Error: Voltage Nominal (V) is required for design phase"]
["HV_LV Switches","P18","Error: Voltage Nominal (V) is required for design phase"]
["HV_LV Switches","Q18","Error: Voltage Nominal (V) is required for design phase"]
["HV_LV Switches","R18","Error: Voltage Nominal (V) is required for design phase"]
["HV_LV Switches","K22","Error: EQ Reference Equipment Desc is required for design phase"]
["HV_LV Switches","L22","Error: EQ Reference Equipment Desc is required for design phase"]
["HV_LV Switches","M22","Error: EQ Reference Equipment Desc is required for design phase"]
["HV_LV Switches","N22","Error: EQ Reference Equipment Desc is required for design phase"]
["HV_LV Switches","O22","Error: EQ Reference Equipment Desc is required for design phase"]
["HV_LV Switches","P22","Error: EQ Reference Equipment Desc is required for design phase"]
["HV_LV Switches","Q22","Error: EQ Reference Equipment Desc is required for design phase"]
["HV_LV Switches","R22","Error: EQ Reference Equipment Desc is required for design phase"]
["HV_LV Switches","K23","Error: EQ Technical Object Type is required for design phase"]
["HV_LV Switches","L23","Error: EQ Technical Object Type is required for design phase"]
["HV_LV Switches","M23","Error: EQ Technical Object Type is required for design phase"]
["HV_LV Switches","N23","Error: EQ Technical Object Type is required for design phase"]
["HV_LV Switches","O23","Error: EQ Technical Object Type is required for design phase"]
["HV_LV Switches","P23","Error: EQ Technical Object Type is required for design phase"]
["HV_LV Switches","Q23","Error: EQ Technical Object Type is required for design phase"]
["HV_LV Switches","R23","Error: EQ Technical Object Type is required for design phase"]
["HV_LV Switches","K33","Warning: Arc Quenching Medium is missing"]
["HV_LV Switches","L33","Warning: Arc Quenching Medium is missing"]
["HV_LV Switches","M33","Warning: Arc Quenching Medium is missing"]
["HV_LV Switches","N33","Warning: Arc Quenching Medium is missing"]
["HV_LV Switches","O33","Warning: Arc Quenching Medium is missing"]
["HV_LV Switches","P33","Warning: Arc Quenching Medium is missing"]
["HV_LV Switches","Q33","Warning: Arc Quenching Medium is missing"]
["HV_LV Switches","R33","Warning: Arc Quenching Medium is missing"]
["HV_LV Switches","K34","Warning: Control Method is missing"]
["HV_LV Switches","L34","Warning: Control Method is missing"]
["HV_LV Switches","M34","Warning: Control Method is missing"]
["HV_LV Switches","N34","Warning: Control Method is missing"]
["HV_LV Switches","O34","Warning: Control Method is missing"]
["HV_LV Switches","P34","Warning: Control Method is missing"]
["HV_LV Switches","Q34","Warning: Control Method is missing"]
["HV_LV Switches","R34","Warning: Control Method is missing"]
["HV_LV Switches","K35","Warning: Rating - Current (A) is missing"]
["HV_LV Switches","L35","Warning: Rating - Current (A) is missing"]
["HV_LV Switches","M35","Warning: Rating - Current (A) is missing"]
["HV_LV Switches","N35","Warning: Rating - Current (A) is missing"]
["HV_LV Switches","O35","Warning: Rating - Current (A) is missing"]
["HV_LV Switches","P35","Warning: Rating - Current (A) is missing"]
["HV_LV Switches","Q35","Warning: Rating - Current (A) is missing"]
["HV_LV Switches","R35","Warning: Rating - Current (A) is missing"]
["HV_LV Switches","K41","Warning: Phase - Qty is missing"]
["HV_LV Switches","L41","Warning: Phase - Qty is missing"]
["HV_LV Switches","M41","Warning: Phase - Qty is missing"]
["HV_LV Switches","N41","Warning: Phase - Qty is missing"]
["HV_LV Switches","O41","Warning: Phase - Qty is missing"]
["HV_LV Switches","P41","Warning: Phase - Qty is missing"]
["HV_LV Switches","Q41","Warning: Phase - Qty is missing"]
["HV_LV Switches","R41","Warning: Phase - Qty is missing"]
["HV_LV Switches","K42","Warning: Voltage Rating (V) is missing"]
["HV_LV Switches","L42","Warning: Voltage Rating (V) is missing"]
["HV_LV Switches","M42","Warning: Voltage Rating (V) is missing"]
["HV_LV Switches","N42","Warning: Voltage Rating (V) is missing"]
["HV_LV Switches","O42","Warning: Voltage Rating (V) is missing"]
["HV_LV Switches","P42","Warning: Voltage Rating (V) is missing"]
["HV_LV Switches","Q42","Warning: Voltage Rating (V) is missing"]
["HV_LV Switches","R42","Warning: Voltage Rating (V) is missing"]
["HV_LV Switches","K49","Error: EQ Reference Equipment Desc is required for design phase"]
["HV_LV Switches","L49","Error: EQ Reference Equipment Desc is required for design phase"]
["HV_LV Switches","M49","Error: EQ Reference Equipment Desc is required for design phase"]
["HV_LV Switches","N49","Error: EQ Reference Equipment Desc is required for design phase"]
["HV_LV Switches","O49","Error: EQ Reference Equipment Desc is required for design phase"]
["HV_LV Switches","P49","Error: EQ Reference Equipment Desc is required for design phase"]
["HV_LV Switches","Q49","Error: EQ Reference Equipment Desc is required for design phase"]
["HV_LV Switches","R49","Error: EQ Reference Equipment Desc is required for design phase"]
["HV_LV Switches","K50","Error: EQ Technical Object Type is required for design phase"]
["HV_LV Switches","L50","Error: EQ Technical Object Type is required for design phase"]
["HV_LV Switches","M50","Error: EQ Technical Object Type is required for design phase"]
["HV_LV Switches","N50","Error: EQ Technical Object Type is required for design phase"]
["HV_LV Switches","O50","Error: EQ Technical Object Type is required for design phase"]
["HV_LV Switches","P50","Error: EQ Technical Object Type is required for design phase"]
["HV_LV Switches","Q50","Error: EQ Technical Object Type is required for design phase"]
["HV_LV Switches","R50","Error: EQ Technical Object Type is required for design phase"]
["HV_LV Switches","K58","Error: EQ Reference Equipment Desc is required for design phase"]
["HV_LV Switches","L58","Error: EQ Reference Equipment Desc is required for design phase"]
["HV_LV Switches","M58","Error: EQ Reference Equipment Desc is required for design phase"]
["HV_LV Switches","N58","Error: EQ Reference Equipment Desc is required for design phase"]
["HV_LV Switches","O58","Error: EQ Reference Equipment Desc is required for design phase"]
["HV_LV Switches","P58","Error: EQ Reference Equipment Desc is required for design phase"]
["HV_LV Switches","Q58","Error: EQ Reference Equipment Desc is required for design phase"]
["HV_LV Switches","R58","Error: EQ Reference Equipment Desc is required for design phase"]
["HV_LV Switches","K59","Error: EQ Technical Object Type is required for design phase"]
["HV_LV Switches","L59","Error: EQ Technical Object Type is required for design phase"]
["HV_LV Switches","M59","Error: EQ Technical Object Type is required for design phase"]
["HV_LV Switches","N59","Error: EQ Technical Object Type is required for design phase"]
["HV_LV Switches","O59","Error: EQ Technical Object Type is required for design phase"]
["HV_LV Switches","P59","Error: EQ Technical Object Type is required for design phase"]
["HV_LV Switches","Q59","Error: EQ Technical Object Type is required for design phase"]
["HV_LV Switches","R59","Error: EQ Technical Object Type is required for design phase"]
["HV_LV Switches","K67","Error: EQ Reference Equipment Desc is required for design phase"]
["HV_LV Switches","L67","Error: EQ Reference Equipment Desc is required for design phase"]
["HV_LV Switches","M67","Error: EQ Reference Equipment Desc is required for design phase"]
["HV_LV Switches","N67","Error: EQ Reference Equipment Desc is required for design phase"]
["HV_LV Switches","O67","Error: EQ Reference Equipment Desc is required for design phase"]
["HV_LV Switches","P67","Error: EQ Reference Equipment Desc is required for design phase"]
["HV_LV Switches","Q67","Error: EQ Reference Equipment Desc is required for design phase"]
["HV_LV Switches","R67","Error: EQ Reference Equipment Desc is required for design phase"]
["HV_LV Switches","K68","Error: EQ Technical Object Type is required for design phase"]
["HV_LV Switches","L68","Error: EQ Technical Object Type is required for design phase"]
["HV_LV Switches","M68","Error: EQ Technical Object Type is required for design phase"]
["HV_LV Switches","N68","Error: EQ Technical Object Type is required for design phase"]
["HV_LV Switches","O68","Error: EQ Technical Object Type is required for design phase"]
["HV_LV Switches","P68","Error: EQ Technical Object Type is required for design phase"]
["HV_LV Switches","Q68","Error: EQ Technical Object Type is required for design phase"]
["HV_LV Switches","R68","Error: EQ Technical Object Type is required for design phase"]
["HV_LV Switches","K69","Error: Commissioned Date (DD/MM/YYYY) is required for design phase"]
["HV_LV Switches","L69","Error: Commissioned Date (DD/MM/YYYY) is required for design phase"]
["HV_LV Switches","M69","Error: Commissioned Date (DD/MM/YYYY) is required for design phase"]
["HV_LV Switches","N69","Error: Commissioned Date (DD/MM/YYYY) is required for design phase"]
["HV_LV Switches","O69","Error: Commissioned Date (DD/MM/YYYY) is required for design phase"]
["HV_LV Switches","P69","Error: Commissioned Date (DD/MM/YYYY) is required for design phase"]
["HV_LV Switches","Q69","Error: Commissioned Date (DD/MM/YYYY) is required for design phase"]
["HV_LV Switches","R69","Error: Commissioned Date (DD/MM/YYYY) is required for design phase"]
["HV_LV Switches","K83","Error: EQ Reference Equipment Desc is required for design phase"]
["HV_LV Switches","L83","Error: EQ Reference Equipment Desc is required for design phase"]
["HV_LV Switches","M83","Error: EQ Reference Equipment Desc is required for design phase"]
["HV_LV Switches","N83","Error: EQ Reference Equipment Desc is required for design phase"]
["HV_LV Switches","O83","Error: EQ Reference Equipment Desc is required for design phase"]
["HV_LV Switches","P83","Error: EQ Reference Equipment Desc is required for design phase"]
["HV_LV Switches","Q83","Error: EQ Reference Equipment Desc is required for design phase"]
["HV_LV Switches","R83","Error: EQ Reference Equipment Desc is required for design phase"]
["HV_LV Switches","K84","Error: EQ Technical Object Type is required for design phase"]
["HV_LV Switches","L84","Error: EQ Technical Object Type is required for design phase"]
["HV_LV Switches","M84","Error: EQ Technical Object Type is required for design phase"]
["HV_LV Switches","N84","Error: EQ Technical Object Type is required for design phase"]
["HV_LV Switches","O84","Error: EQ Technical Object Type is required for design phase"]
["HV_LV Switches","P84","Error: EQ Technical Object Type is required for design phase"]
["HV_LV Switches","Q84","Error: EQ Technical Object Type is required for design phase"]
["HV_LV Switches","R84","Error: EQ Technical Object Type is required for design phase"]
["TRANSFORMER","K8","Error: FLOC Construction Type is required for design phase"]
["TRANSFORMER","K9","Error: FLOC Technical Object Type is required for design phase"]
["TRANSFORMER","K18","Error: KVA Rating (kVA) is required for design phase"]
["TRANSFORMER","K19","Error: Phase - Qty is required for design phase"]
["TRANSFORMER","K25","Error: EQ Reference Equipment Desc is required for design phase"]
["TRANSFORMER","K26","Error: EQ Technical Object Type is required for design phase"]
["TRANSFORMER","K52","Error: KVA Rating is required for design phase"]