{"text_format":"1","workbook":"xlsx","n_sheets":24,"sheets":["Formulae","Error Log","Debug","SAPJOB","SAPTAL","SAPRANGES","SAPMSG","REFEQUIP","FLCONTYPE","ELIST","Tarrif_Config","PROJECT","POLE","COLUMN","PILLAR","ASSM","SLCP","STREETLIGHT","DSUB (GRND)","DSUB (POLE)","SWITCHGEAR","HV_LV Switches","TRANSFORMER","Errors"],"not_rendered":{"charts":0,"images":1,"macros":1,"external_links":1,"defined_names":220,"comments":2,"pivot_tables":0},"unopened":[],"bounds":{"document_bytes":16777216,"sheet_cells":100000,"rows_first":2000,"rows_last":500,"rows_between":2000,"halvings":0,"cell_chars":16384,"cell_head_chars":4096},"cells_cut":0,"cells_raw":0,"read":"whole","date_system":"1900"}

{"sheet":"Formulae","index":0,"n_rows":169,"n_cols":6,"rows_kept":169,"cut":false,"hidden":true,"merged":[]}
[null,"FLOC_CONST_D"]
[null,"FLOC_TOT_D",null,null,"<>"]
[null,"REF_EQ_D",null,null,"="]
[null,"EQ_TOT_D",null,null,"*"]
[null,"STREETNAME"]
[null,"SUBURB"]
[null,"LOCATIONNOTES"]
[]
{"$rows_left_out":162}
{"sheet":"Error Log","index":1,"n_rows":237,"n_cols":4,"rows_kept":237,"cut":false,"hidden":true,"merged":[]}
["Equip Class","Equip No.","Asset No.","Error Message"]
["Range address $K$4 6",null,null,"Proc SetValidations - Application-defined or object-defined error"]
["Range address $K$4 6",null,null,"Proc SetValidations - Application-defined or object-defined error"]
["POLE - LIST",8,11,"Proc Update_DVs - Object variable or With block variable not set"]
["Range address $K$8 3",{"$f":"TAL_FLOC_CONST_D","v":{"$error":"#NAME?"}},null,"Proc SetValidations - Application-defined or object-defined error"]
["Range address $K$8 3",{"$f":"TAL_FLOC_CONST_D","v":{"$error":"#NAME?"}},null,"Proc SetValidations - Application-defined or object-defined error"]
["Range address $K$8 3",{"$f":"TAL_FLOC_CONST_D","v":{"$error":"#NAME?"}},null,"Proc SetValidations - Application-defined or object-defined error"]
["Range address $K$55 6",null,null,"Proc SetValidations - Application-defined or object-defined error"]
{"$rows_left_out":230}
{"sheet":"Debug","index":2,"n_rows":49,"n_cols":6,"rows_kept":49,"cut":false,"hidden":true,"merged":[]}
["Sheet","Row","Column","Error"]
["2025-09-05T10:02:32","SAPTAL_Read","ASSM",0,11,"Unable to locate attribute POLEPLANT for FLOC ASSM00739414"]
["2025-09-05T10:02:33","SAPTAL_Read","ASSM",0,12,"Unable to locate attribute POLEPLANT for FLOC ASSM00739415"]
["2025-09-05T10:02:33","SAPTAL_Read","ASSM",0,13,"Unable to locate attribute POLEPLANT for FLOC ASSM00739416"]
["2025-09-05T10:02:34","SAPTAL_Read","ASSM",0,14,"Unable to locate attribute POLEPLANT for FLOC ASSM00739417"]
["2025-09-05T10:02:35","SAPTAL_Read","SWITCHGEAR",0,11,"Unable to locate attribute POLEPLANT for FLOC BBHV00020874"]
["2025-09-05T10:02:35","SAPTAL_Read","SWITCHGEAR",0,12,"Unable to locate attribute POLEPLANT for FLOC BBLV00038807"]
["2025-09-05T10:02:36","SAPTAL_Read","COLUMN",0,11,"Unable to locate attribute POLEPLANT for FLOC CLMN09557866"]
{"$rows_left_out":42}
{"sheet":"SAPJOB","index":3,"n_rows":2,"n_cols":5,"rows_kept":2,"cut":false,"hidden":true,"merged":[]}
["PROJNUM","DRAWING","CAP APPLICATION NUMBER","SOURCEBY","SOURCEMAIL"]
[null,null,"VAS2708","26395"]

{"sheet":"SAPTAL","index":4,"n_rows":149,"n_cols":8,"rows_kept":149,"cut":false,"hidden":true,"merged":[]}
["PROJNUM","TABLABEL","FLOC","PROCMETHOD","TARGETOBJECT","SOURCEATTRIBUTE","SOURCEVALUE"]
[null,"ASSM","ASSM00739414","FLOC&EQ","FLOC","FLOC","ASSM00739414","ü"]
[null,"ASSM","ASSM00739414","FLOC&EQ","FLOC","REFLOC_D","ASSMPOLE0001","ü"]
[null,"ASSM","ASSM00739414","FLOC&EQ","FLOC","ABCKZ","O","ü"]
[null,"ASSM","ASSM00739414","FLOC&EQ","FLOC","POLEPLANT","100","û"]
[null,"ASSM","ASSM00739414","FLOC&EQ","FLOC","SUPFLOC","POLE01004994","ü"]
[null,"ASSM","ASSM00739414","FLOC&EQ","FLOC","MAINTLOC","1130","ü"]
[null,"ASSM","ASSM00739415","FLOC&EQ","FLOC","FLOC","ASSM00739415","ü"]
{"$rows_left_out":142}
{"sheet":"SAPRANGES","index":5,"n_rows":3597,"n_cols":4,"rows_kept":3597,"cut":false,"hidden":true,"merged":[]}
["Range","Role","Value","Code"]
["AM_BALL_COLOUR","Header","Description","Code"]
["AM_BALL_COLOUR","Value","Orange Marker Ball","ORANGE"]
["AM_BALL_COLOUR","Value","Red Marker Ball","RED"]
["AM_BALL_COLOUR","Value","White Marker Ball","WHITE"]
["AM_BALL_COLOUR","Value","Yellow Marker Ball","YELLOW"]
["AM_BALL_PURPOSE","Header","Description","Code"]
["AM_BALL_PURPOSE","Value","Aircraft Marker Ball","AIRCRAFT"]
{"$rows_left_out":3590}
{"sheet":"SAPMSG","index":6,"n_rows":1,"n_cols":3,"rows_kept":1,"cut":false,"hidden":true,"merged":[]}
["FLOC","MSG_FLOC","MSG_EQ"]

{"sheet":"REFEQUIP","index":7,"n_rows":594,"n_cols":6,"rows_kept":594,"cut":false,"hidden":true,"merged":[]}
["Reference Equipment No","Reference Equipment Desc","Technical Object Type","Technical Object Type Desc"]
["000000001002471714","Gen, 3 Phase Magnetic VT","VT_3PHVT","3 Phase Magnetic VT",{"$f":"IFERROR(VLOOKUP(C2,ELIST!$A$2:$E$300,2,FALSE),0)","v":0},{"$f":"IFERROR(VLOOKUP(C2,ELIST!$A$2:$E$300,5,FALSE),0)","v":0}]
["000000001002471715","3 Phase Magnetic VT Oil Outdoor","VT_3PHVT","3 Phase Magnetic VT",{"$f":"IFERROR(VLOOKUP(C3,ELIST!$A$2:$E$300,2,FALSE),0)","v":0},{"$f":"IFERROR(VLOOKUP(C3,ELIST!$A$2:$E$300,5,FALSE),0)","v":0}]
["000000001002471716","3 Phase Magnetic VT Oil Indoor","VT_3PHVT","3 Phase Magnetic VT",{"$f":"IFERROR(VLOOKUP(C4,ELIST!$A$2:$E$300,2,FALSE),0)","v":0},{"$f":"IFERROR(VLOOKUP(C4,ELIST!$A$2:$E$300,5,FALSE),0)","v":0}]
["000000001002471717","3 Phase Magnetic VT SF6 Outdoor","VT_3PHVT","3 Phase Magnetic VT",{"$f":"IFERROR(VLOOKUP(C5,ELIST!$A$2:$E$300,2,FALSE),0)","v":0},{"$f":"IFERROR(VLOOKUP(C5,ELIST!$A$2:$E$300,5,FALSE),0)","v":0}]
["000000001002471718","3 Phase Magnetic VT SF6 Indoor","VT_3PHVT","3 Phase Magnetic VT",{"$f":"IFERROR(VLOOKUP(C6,ELIST!$A$2:$E$300,2,FALSE),0)","v":0},{"$f":"IFERROR(VLOOKUP(C6,ELIST!$A$2:$E$300,5,FALSE),0)","v":0}]
["000000001002471719","3 Phase Magnetic VT Epoxy Outdoor","VT_3PHVT","3 Phase Magnetic VT",{"$f":"IFERROR(VLOOKUP(C7,ELIST!$A$2:$E$300,2,FALSE),0)","v":0},{"$f":"IFERROR(VLOOKUP(C7,ELIST!$A$2:$E$300,5,FALSE),0)","v":0}]
["000000001002471720","3 Phase Magnetic VT Epoxy Indoor","VT_3PHVT","3 Phase Magnetic VT",{"$f":"IFERROR(VLOOKUP(C8,ELIST!$A$2:$E$300,2,FALSE),0)","v":0},{"$f":"IFERROR(VLOOKUP(C8,ELIST!$A$2:$E$300,5,FALSE),0)","v":0}]
{"$rows_left_out":587}
{"sheet":"FLCONTYPE","index":8,"n_rows":139,"n_cols":5,"rows_kept":139,"cut":false,"hidden":true,"merged":[]}
["Reference Functional Location","FL's Construction Type","FL's Construction Type Desc","FL's Technical Object Type","FL's Technical Object Type Desc"]
["ASSMCLMN0001","000000005000000632","Gen, UG Termination","GD_UGTERM","UG Termination"]
["ASSMCLMN0001","000000005000000634","Termination UG - LV Mains Bolted","GD_UGTERM","UG Termination"]
["ASSMCLMN0001","000000005000000635","Termination UG LV Mains- Panel","GD_UGTERM","UG Termination"]
["ASSMCLMN0001","000000005000000636","Termination UG - LV Service Mains","GD_UGTERM","UG Termination"]
["ASSMCLMN0001","000000005000000637","Termination UG - SL Mains","GD_UGTERM","UG Termination"]
["ASSMPILL0001","000000005000000632","Gen, UG Termination","GD_UGTERM","UG Termination"]
["ASSMPILL0001","000000005000000634","Termination UG - LV Mains Bolted","GD_UGTERM","UG Termination"]
{"$rows_left_out":132}
{"sheet":"ELIST","index":9,"n_rows":74,"n_cols":5,"rows_kept":74,"cut":false,"hidden":true,"merged":[]}
["Code","Range","Role","Value"]
["OH_UGOH","ASSM",null,"UG/OH Termination"]
["OH_TRASSM","ASSM",null,"TR Overhead Assembly"]
["OH_HVASSM","ASSM",null,"HV Overhead Assembly"]
["OH_LVASSM","ASSM",null,"LV Overhead Assembly"]
["OH_PCTE","ASSM",null,"Pilot Termination"]
["OH_PILOT","ASSM",null,"Pilot Cable"]
["OH_EWIRE","ASSM",null,"Earth Wire"]
{"$rows_left_out":67}
{"sheet":"Tarrif_Config","index":10,"n_rows":109,"n_cols":72,"rows_kept":109,"cut":false,"hidden":true,"merged":[]}
["TariffClass","Code","Luminaire","Code","EQUIP","_TC1","_TC2","_TC3","_TC4","_TC5","_TC6",null,"Range","Role","Value","Code",null,"Luminaire","Code","_TC1","_TC2","_TC3","_TC4","_TC5","_TC6","EQUIP",null,"Range","Role","Value","Code",null,null,"HorizontalSupport","Code","Rates","_TC1","_TC2","_TC3","_TC4","_TC5","_TC6",null,"HorizontalSupport","Code","Rates","_TC1","_TC2","_TC3","_TC4","_TC5","_TC6",null,"VerticalSupport","Code","Rates","_TC1","_TC2","_TC3","_TC4","_TC5","_TC6",null,"VerticalSupport","Code","Rates","_TC1","_TC2","_TC3","_TC4","_TC5","_TC6"]
["+STC,,,,Y",null,"+SLU,,,,",null,null,null,null,null,null,null,null,null,"SL_TARIFF_CLASS","Value","(1) Legacy, Constructed by EE","1",null,"+SLU,,,,",null,null,null,null,null,null,null,null,null,"HORIZ_SUPPORT_TARIFF","Value","Leg -Owned, const, maint by EE","1",null,null,"+SHS,,,,",null,null,null,null,null,null,null,null,null,"+SHS,,,,",null,null,null,null,null,null,null,null,null,"+SVS,,,,",null,null,null,null,null,null,null,null,null,"+SVS,,,,"]
["(1) Legacy, Constructed by EE",1,"42W CFL - AEROSCREEN","CF42AS",{"$f":"IFERROR(VLOOKUP($D3,$S$1:$Z$81,MATCH(E$1,$S$1:$Z$1,0),FALSE),0)","v":"Streetlight Lantern - Fluro Type"},{"$f":"IFERROR(VLOOKUP($D3,$S$1:$Z$81,MATCH(F$1,$S$1:$Z$1,0),FALSE),0)","v":0},0,578,878,0,746,null,"SL_TARIFF_CLASS","Value","(2) Legacy, Gift by Customer","2",null,"9W LED STREETLED Aeroscreen S-S","L009SA",0,0,434,758,0,0,"Streetlight Lantern - LED Type",null,"HORIZ_SUPPORT_TARIFF","Value","Leg -Gift by cust, maint by EE","2",null,null,"Bracket - Major (>3M)","BRMA",null,{"$f":"IFERROR(VLOOKUP($AH3,$AR$1:$AZ$13,MATCH(AK$1,$AR$1:$AZ$1,0),FALSE),0)","v":0},{"$f":"IFERROR(VLOOKUP($AH3,$AR$1:$AZ$13,MATCH(AL$1,$AR$1:$AZ$1,0),FALSE),0)","v":0},591,891,0,793,null,"Bracket - Major (>3M)","BRMA",591891793,0,0,591,891,0,793,null,"Column (Al) - Major (>9M)","CAMA",null,{"$f":"IFERROR(VLOOKUP($BC3,$BM$1:$BT$15,MATCH(BE$1,$BM$1:$BT$1,0),FALSE),0)","v":0},{"$f":"IFERROR(VLOOKUP($BC3,$BM$1:$BT$15,MATCH(BF$1,$BM$1:$BT$1,0),FALSE),0)","v":0},0,0,0,0,null,"Column (Steel) - Major (>9M)","CSMA",696996796,0,0,696,996,0,796]
["(2) Legacy, Gift by Customer",2,"42W CFL - BOURKE HILL","CF42BH",{"$f":"IFERROR(VLOOKUP($D4,$S$1:$Z$81,MATCH(E$1,$S$1:$Z$1,0),FALSE),0)","v":"Streetlight Lantern - Fluro Type"},0,0,583,883,0,751,null,"SL_TARIFF_CLASS","Value","(3) Annuity, Constructed by EE","3",null,"13W LED ATS PLED MKII","L013AP",0,0,456,780,0,0,"Streetlight Lantern - LED Type",null,"HORIZ_SUPPORT_TARIFF","Value","Annuity-Own, Const Maint By EE","3",null,null,"Bracket - Minor (<3M)","BRMI",null,{"$f":"IFERROR(VLOOKUP($AH4,$AR$1:$AZ$13,MATCH(AK$1,$AR$1:$AZ$1,0),FALSE),0)","v":0},0,590,890,0,792,null,"Bracket - Minor (<3M)","BRMI",590890792,0,0,590,890,0,792,null,"Column (Al) - Minor (<=9M)","CAMI",null,{"$f":"IFERROR(VLOOKUP($BC4,$BM$1:$BT$15,MATCH(BE$1,$BM$1:$BT$1,0),FALSE),0)","v":0},0,0,0,0,0,null,"Column (Steel) - Minor (<9M)","CSMI",695995795,0,0,695,995,0,795]
["(3) Annuity, Constructed by EE",3,"42W CFL - POST TOP","CF42PT","Streetlight Lantern - Fluro Type",0,0,580,880,0,748,null,"SL_TARIFF_CLASS","Value","(4) Annuity, Gift by Customer","4",null,"13W LED StreetLED3 STD Visor S-S","L013SS",0,0,433,757,0,0,"Streetlight Lantern - LED Type",null,"HORIZ_SUPPORT_TARIFF","Value","Annuity-Gift By Cus, Mnt By EE","4",null,null,"Legacy - Major Bracket (>3M)","LBRMA",null,0,0,0,0,0,0,null,"Legacy - Major Bracket (>3M)","LBRMA",225428,0,0,0,0,0,0,null,"Column (Steel) - Major (>9M)","CSMA",null,0,0,696,996,0,796,null,"Legacy - Major Column (>9M)","LCSMA",229426,229,426,0,0,0,0]
["(4) Annuity, Gift by Customer",4,"42W CFL - STANDARD","CF42ST","Streetlight Lantern - Fluro Type",0,0,553,853,0,718,null,"SL_TARIFF_CLASS","Value","(6) Owned by Customer","6",null,"17W LED Post Top B2001 S-S","L017PS",0,0,435,759,0,0,"Streetlight Lantern - LED Type",null,"HORIZ_SUPPORT_TARIFF","Value","Owned By Cust & Maint By EE","6",null,null,"Legacy - Minor Bracket (<3M)","LBRMI",null,0,0,0,0,0,0,null,"Legacy - Minor Bracket (<3M)","LBRMI",224427,0,0,0,0,0,0,null,"Column (Steel) - Minor (<9M)","CSMI",null,0,0,695,995,0,795,null,"Legacy - Minor Column (<9M)","LCSMI",228425,228,425,0,0,0,0]
["(6) Owned by Customer",6,"100W Sodium - AEROSCREEN","HP10AS","Streetlight Lantern - HPS/MH Type",0,0,579,879,0,747,null,null,null,null,null,null,"17W LED B2001 NUWE Post Top","L017PT",0,0,665,965,0,0,"Streetlight Lantern - LED Type",null,null,null,null,null,null,null,"Legacy - Major Outreach (>2M)","LOTMA",null,0,0,0,0,0,0,null,"Legacy - Major Outreach (>2M)","LOTMA",227424,0,0,0,0,0,0,null,"Legacy - Major Column (>9M)","LCSMA",null,229,426,0,0,0,0,null,"Legacy - Urd Min Column (<9M)","LUCSMI",231,231,0,0,0,0,0]
[null,null,"150W Sodium - FLOODLIGHT","HP15FL","Streetlight Lantern - HPS/MH Type",0,0,581,881,0,749,null,null,null,null,null,null,"17W LED STREETLED3 Aeroscreen S-S","L017SA",0,0,432,756,0,0,"Streetlight Lantern - LED Type",null,null,null,null,null,null,null,"Legacy - Minor Outreach (<2M)","LOTMI",null,0,0,0,0,0,0,null,"Legacy - Minor Outreach (<2M)","LOTMI",226423,0,0,0,0,0,0,null,"Legacy - Minor Column (<9M)","LCSMI",null,228,425,0,0,0,0,null,"Legacy - Maj Wood Pole (>11M)","LWPMA",233430,233,430,0,0,0,0]
{"$rows_left_out":102}
{"sheet":"PROJECT","index":11,"n_rows":19,"n_cols":6,"rows_kept":19,"cut":false,"hidden":false,"merged":[[16,1,16,9],[17,1,17,9],[18,1,18,9],[19,0,19,10],[0,0,0,10],[6,6,6,7],[12,1,12,9],[13,1,13,9],[14,1,14,9],[15,1,15,9]]}
["Project Details"]
[]
[null,"CAP No:",null,"VAS2708",null,"External Use Only"]
[]
[null,"Project No:",null,null,null,"Endeavour Use Only"]
[]
[null,"Drawing No:     Retic:",null,null,null,"Duct:"]
[]
{"$rows_left_out":12}
{"sheet":"POLE","index":12,"n_rows":79,"n_cols":11,"rows_kept":79,"cut":false,"hidden":false,"merged":[]}
["Source Code","Asset Type","Field","Min Value","Max Value","Field Entry","Default","Locked?","Additional info (Not in the VB","Poles"]
["FLOC","FLOC","Pre-Populated",null,null,null,null,"L",null,"Functional Location","POLE01004994"]
["REFLOC_D","FLOC","Pre-Populated",null,null,null,null,"L",null,"Reference Functional Location","POLEPOLE0001"]
["DELETIONFLAG","FLOC","CHAR",null,null,null,null,null,null,"Flag for Deletion (Mark as 'X')"]
["NULL"]
["SORTFIELD","FLOC","CHAR",0,30,null,null,null,null,"Pole Plate Number (Sort Field)","PL1004994"]
["SUPFLOC","FLOC","Pre-Populated",0,12,null,null,null,null,"Superior Functional Location"]
["FLOC_CONST_D","FLOC","LIST",null,null,null,null,"D",null,"FLOC Construction Type"]
{"$rows_left_out":72}
{"sheet":"COLUMN","index":13,"n_rows":74,"n_cols":11,"rows_kept":74,"cut":false,"hidden":false,"merged":[]}
["Source Code","Asset Type","Field","Min Value","Max Value","Field Entry","Default","Locked?",null,"Columns"]
["FLOC","FLOC","Pre-Populated",null,null,null,null,"L",null,"Functional Location","CLMN09557866"]
["REFLOC_D","FLOC","Pre-Populated",null,null,null,null,"L",null,"Reference Functional Location","CLMNCLMN0001"]
["DELETIONFLAG","FLOC","CHAR",0,1,null,null,null,null,"Flag for Deletion (Mark as 'X')"]
["NULL"]
["SORTFIELD","FLOC","CHAR",0,30,null,null,null,null,"Column Plate Number (Sort Field)","CL9557866"]
["SUPFLOC","FLOC","Pre-Populated",0,12,null,null,null,null,"Superior Functional Location"]
["FLOC_CONST_D","FLOC","LIST",null,null,null,null,"D",null,"FLOC Construction Type"]
{"$rows_left_out":67}
{"sheet":"PILLAR","index":14,"n_rows":70,"n_cols":12,"rows_kept":70,"cut":false,"hidden":false,"merged":[]}
["Source Code","Asset Type","Field","Min Value","Max Value","Field Entry","Default","Locked?",null,"Pillars"]
["FLOC","FLOC","Pre-Populated",null,null,null,null,"L",null,"Functional Location","PILL00411701","PILL00411702"]
["REFLOC_D","FLOC","Pre-Populated",null,null,null,null,"L",null,"Reference Functional Location","PILLPILL0001","PILLPILL0001"]
["DELETIONFLAG","FLOC","CHAR",0,1,null,null,null,null,"Flag for Deletion (Mark as 'X')"]
["NULL"]
["SORTFIELD","FLOC","CHAR",0,30,null,null,null,null,"Pillar Plate Number (Sort Field)","LV411701","LV411702"]
["SUPFLOC","FLOC","Pre-Populated",0,12,null,null,null,null,"Superior Functional Location"]
["FLOC_CONST_D","FLOC","LIST",null,null,null,null,"D",null,"FLOC Construction Type"]
{"$rows_left_out":63}
{"sheet":"ASSM","index":15,"n_rows":26,"n_cols":14,"rows_kept":26,"cut":false,"hidden":true,"merged":[]}
["Source Code","Asset Type","Field","Min Value","Max Value","Field Entry","Default","Locked?",null,"Assembly"]
["FLOC","FLOC","Pre-Populated",null,null,null,null,"L",null,"Functional Location","ASSM00739414","ASSM00739415","ASSM00739416","ASSM00739417"]
["REFLOC_D","FLOC","Pre-Populated",null,null,null,null,"L",null,"Reference Functional Location","ASSMPOLE0001","ASSMCLMN0001","ASSMPILL0001","ASSMPILL0001"]
["DELETIONFLAG","FLOC","CHAR",null,null,null,null,null,null,"Flag for Deletion (Mark as 'X')"]
["NULL"]
["SORTFIELD","FLOC","CHAR",0,30,null,null,null,null,"ASSM Plate Number (Sort Field)"]
["SUPFLOC","FLOC","Pre-Populated",0,12,null,null,null,null,"Superior Functional Location","POLE01004994","CLMN09557866","PILL00411701","PILL00411702"]
["FLOC_CONST_D","FLOC","LIST",null,null,null,null,null,null,"FLOC Construction Type"]
{"$rows_left_out":19}
{"sheet":"SLCP","index":16,"n_rows":36,"n_cols":10,"rows_kept":36,"cut":false,"hidden":false,"merged":[]}
["Source Code","Asset Type","Field","Min Value","Max Value","Field Entry","Default","Locked?",null,"SLCPs"]
["FLOC","FLOC","Pre-Populated",null,null,null,null,"L",null,"Functional Location"]
["REFLOC_D","FLOC","Pre-Populated",null,null,null,null,"L",null,"Reference Functional Location"]
["DELETIONFLAG","FLOC","CHAR",null,null,null,null,null,null,"Flag for Deletion (Mark as 'X')"]
["NULL"]
["SORTFIELD","FLOC","CHAR",0,30,null,null,null,null,"SLCP Plate Number (Sort Field)"]
["SUPFLOC","FLOC","Pre-Populated",0,12,null,null,"D",null,"Superior Functional Location"]
["FLOC_CONST_D","FLOC","LIST",null,null,null,null,"D",null,"FLOC Construction Type"]
{"$rows_left_out":29}
{"sheet":"STREETLIGHT","index":17,"n_rows":55,"n_cols":11,"rows_kept":55,"cut":false,"hidden":false,"merged":[]}
["Source Code","Asset Type","Field","Min Value","Max Value","Field Entry","Default","Locked?",null,"Streetlights"]
["FLOC","FLOC","Pre-Populated",null,null,"M",null,"L",null,"Functional Location","SLGT00314229"]
["REFLOC_D","FLOC","Pre-Populated",null,null,null,null,"L",null,"Reference Functional Location","SLGTCLMN0001"]
["DELETIONFLAG","FLOC","CHAR",0,1,null,null,null,null,"Flag for Deletion (Mark as 'X')"]
["NULL"]
["SORTFIELD","FLOC","CHAR",0,30,null,null,null,null,"Streetlight Plate Number (Sort Field)","SL314229"]
["SUPFLOC","FLOC","Pre-Populated",0,12,null,null,null,null,"Superior Functional Location","CLMN09557866"]
["FLOC_CONST_D","FLOC","LIST",null,null,null,null,"D",null,"FLOC Construction Type"]
{"$rows_left_out":48}
{"sheet":"DSUB (GRND)","index":18,"n_rows":95,"n_cols":12,"rows_kept":95,"cut":false,"hidden":false,"merged":[]}
["Source Code","Asset Type","Field","Min Value","Max Value","Field Entry","Default","Locked?",null,"Substations"]
["FLOC","FLOC","Pre-Populated",null,null,"L",null,"L",null,"Functional Location","DSUB00097041","DSUB00097042"]
["REFLOC_D","FLOC","Pre-Populated",null,null,null,null,"L",null,"Reference Functional Location","DSUBDSUB0001","DSUBDSUB0001"]
["DELETIONFLAG","FLOC","CHAR",null,null,null,null,null,null,"Flag for Deletion (Mark as 'X')"]
["NULL"]
["SORTFIELD","FLOC","CHAR",0,30,null,null,null,null,"DSUB Plate Number (Sort Field)","DS97041","DS97042"]
["SUPFLOC","FLOC","Pre-Populated",0,12,null,null,null,null,"Superior Functional Location"]
["FLOC_CONST_D","FLOC","LIST",null,null,null,null,"D",null,"FLOC Construction Type"]
{"$rows_left_out":88}
{"sheet":"DSUB (POLE)","index":19,"n_rows":59,"n_cols":10,"rows_kept":59,"cut":false,"hidden":false,"merged":[]}
["Source Code","Asset Type","Field","Min Value","Max Value","Field Entry","Default","Locked?",null,"Substations"]
["FLOC","FLOC","Pre-Populated",null,null,null,null,"L",null,"Functional Location"]
["REFLOC_D","FLOC","Pre-Populated",null,null,null,null,"L",null,"Reference Functional Location"]
["DELETIONFLAG","FLOC","CHAR",null,null,null,null,null,null,"Flag for Deletion (Mark as 'X')"]
["NULL"]
["SORTFIELD","FLOC","CHAR",0,30,null,null,null,null,"DSUB Plate Number (Sort Field)"]
["SUPFLOC","FLOC","Pre-Populated",0,12,null,null,"D",null,"Superior Functional Location"]
["FLOC_CONST_D","FLOC","LIST",null,null,null,null,"D",null,"FLOC Construction Type"]
{"$rows_left_out":52}
{"sheet":"SWITCHGEAR","index":20,"n_rows":54,"n_cols":14,"rows_kept":54,"cut":false,"hidden":false,"merged":[]}
["Source Code","Asset Type","Field","Min Value","Max Value","Field Entry","Default","Locked?",null,"Sub Switchgear"]
["FLOC","FLOC","Pre-Populated",null,null,null,null,"L",null,"Functional Location","LVDG00002916","HVDG00004016","BBLV00038807","BBHV00020874"]
["REFLOC_D","FLOC","Pre-Populated",null,null,null,null,"L",null,"Reference Functional Location","LVDGDSUB0001","HVDGDSUB0001","BBLVDSUB0001","BBHVDSUB0001"]
["DELETIONFLAG","FLOC","CHAR",null,null,null,null,null,null,"Flag for Deletion (Mark as 'X')"]
["NULL"]
["SORTFIELD","FLOC","CHAR",0,30,null,null,null,null,"SwitchGear Plate Number (Sort Field)"]
["SUPFLOC","FLOC","Pre-Populated",0,12,null,null,"D",null,"Superior Functional Location",null,null,"LVDG00002916","HVDG00004016"]
["FLOC_CONST_D","FLOC","LIST",null,null,null,null,"D",null,"FLOC Construction Type"]
{"$rows_left_out":47}
{"sheet":"HV_LV Switches","index":21,"n_rows":90,"n_cols":18,"rows_kept":90,"cut":false,"hidden":false,"merged":[]}
["Source Code","Asset Type","Field","Min Value","Max Value","Field Entry","Default","Locked?",null,"HV/LV Switches"]
["FLOC","FLOC","Pre-Populated",null,null,null,null,"L",null,"Functional Location","DSSW00406722","DSSW00406723","SWIT00245862","SWIT00245863","SWIT00245864","SWIT00245865","SWIT00245866","SWIT00245867"]
["REFLOC_D","FLOC","Pre-Populated",null,null,null,null,"L",null,"Reference Functional Location","DSSWDSUB0001","DSSWDSUB0002","SWITDSUB0001","SWITDSUB0001","SWITDSUB0002","SWITDSUB0002","SWITDSUB0002","SWITDSUB0002"]
["DELETIONFLAG","FLOC","CHAR",null,null,null,null,null,null,"Flag for Deletion (Mark as 'X')"]
["NULL"]
["SORTFIELD","FLOC","CHAR",0,30,null,null,null,null,"Switch Plate Number (Sort Field)"]
["SUPFLOC","FLOC","Pre-Populated",0,12,null,null,"D",null,"Superior Functional Location","HVDG00004016","LVDG00002916","HVDG00004016","HVDG00004016","LVDG00002916","LVDG00002916","LVDG00002916","LVDG00002916"]
["FLOC_CONST_D","FLOC","LIST",null,null,null,null,"D",null,"FLOC Construction Type"]
{"$rows_left_out":83}
{"sheet":"TRANSFORMER","index":22,"n_rows":86,"n_cols":11,"rows_kept":86,"cut":false,"hidden":false,"merged":[]}
["Source Code","Asset Type","Field","Min Value","Max Value","Field Entry","Default","Locked?",null,"Transformers"]
["FLOC","FLOC","Pre-Populated",null,null,null,null,"L",null,"Functional Location","DSTX10005756"]
["REFLOC_D","FLOC","Pre-Populated",null,null,null,null,"L",null,"Reference Functional Location","DSTXDSUB0001"]
["DELETIONFLAG","FLOC","CHAR",null,null,null,null,null,null,"Flag for Deletion (Mark as 'X')"]
["NULL"]
["SORTFIELD","FLOC","CHAR",0,30,null,null,null,null,"Transformer Plate Number (Sort Field)"]
["SUPFLOC","FLOC","Pre-Populated",0,12,null,null,"D",null,"Superior Functional Location","DSUB00097042"]
["FLOC_CONST_D","FLOC","LIST",null,null,null,null,"D",null,"FLOC Construction Type"]
{"$rows_left_out":79}
{"sheet":"Errors","index":23,"n_rows":244,"n_cols":3,"rows_kept":244,"cut":false,"hidden":false,"merged":[]}
["Sheet Name","Cell","Message"]
["POLE","K8","Error: FLOC Construction Type is required for design phase"]
["POLE","K18","Error: Equipment Owner is required for design phase"]
["POLE","K24","Error: Special Use Code is required for design phase"]
["POLE","K29","Error: EQ Reference Equipment Desc is required for design phase"]
["POLE","K30","Error: EQ Technical Object Type is required for design phase"]
["POLE","K59","Error: FLOC Construction Type is required for design phase"]
["POLE","K60","Error: FLOC Technical Object Type is required for design phase"]
{"$rows_left_out":236}