{"text_format":"1","workbook":"xlsx","n_sheets":10,"sheets":["COVER","Page 1 - Introduction","Page 2 - User Instructions","Page 3 - Front Page Letter","Page 4 - NOCC Detail","Lookups","Customer List","Template","FY26 Staging","temp6"],"not_rendered":{"charts":0,"images":4,"macros":1,"external_links":9,"defined_names":761,"comments":0,"pivot_tables":0},"unopened":[],"bounds":{"document_bytes":16777216,"sheet_cells":100000,"rows_first":2000,"rows_last":500,"rows_between":2000,"halvings":0,"cell_chars":16384,"cell_head_chars":4096},"cells_cut":0,"cells_raw":0,"read":"whole","date_system":"1900"}

{"sheet":"COVER","index":0,"n_rows":785,"n_cols":2,"rows_kept":785,"cut":false,"hidden":false,"merged":[]}
[]
[]
[]
[]
[]
[]
[]
[]
[]
[]
[]
[]
[]
[]
[]
[]
[]
[]
[]
[]
[]
[]
[]
[]
[]
[]
[]
[]
[]
[]
[]
[]
[]
[]
[]
[]
[]
[]
[]
[]
[]
[]
[]
[]
[]
[]
[]
[]
[]
[]
[]
[]
[]
[]
[]
[]
[]
[]
[]
[]
{"$rows_left_out":726}
{"sheet":"Page 1 - Introduction","index":1,"n_rows":33,"n_cols":2,"rows_kept":33,"cut":false,"hidden":false,"merged":[[18,0,18,1]]}
[]
["Public Lighting Design"]
[{"$f":"'Page 3 - Front Page Letter'!A6","v":"Version: July 2025"}]
[]
["Notification of change in charges (NOCC)"]
[]
[]
[]
["Brief guide to the Excel document:"]
[]
[1,"This document is provided to enable Project Managers and Accredited Service Providers with a means to:"]
[]
[2,"Calculate the change in SLUoS charges to end customers of Public Lighting assets;"]
[]
[3,"Calculate the TARIFF CLASS 5 charges applicable to assets removed; and,"]
[]
[4,"Provide printable schedules that can be published to end customers for sign and return."]
[]
["The first page also contains a link to Published Public Lighting Schedules on Endeavour Energy’s website (Our Network / Streetlights & Nightwatch)"]
[]
[]
[]
["The document contains seven (6) pages:"]
[]
["Page 1","Introduction"]
[]
["Page 2","User instructions"]
[]
["Page 3","Front page letter"]
[]
["Page 4","Tariff class details"]
[]
["Page 7","HYBRID Rates"]

{"sheet":"Page 2 - User Instructions","index":2,"n_rows":71,"n_cols":8,"rows_kept":71,"cut":false,"hidden":false,"merged":[[43,0,43,7],[52,0,52,1],[51,0,51,7],[48,0,48,7],[47,0,47,7],[46,0,46,7],[42,0,42,7],[41,0,41,7],[38,0,38,7],[37,0,37,7],[1,0,1,8],[2,0,2,8]]}
[]
["NOTIFICATION of CHANGE in CHARGES (NOCC)"]
["User Instructions"]
["Purpose","This document is provided to enable:"]
[null,1,"Project Managers and Accredited Service Providers with a means to "]
[null,2,"Calculate the change in SLUOS charges to end customers of Public Lighting assets and"]
[null,3,"Calculate the TARIFF CLASS 5 charges applicable to assets removed and provide"]
[null,4,"Printable schedules that can be published to end customers for sign & return"]
[]
["Resources","Published Public Lighting Price Schedules"]
[]
["User Instruction Sheet"]
[]
[null,"Asset Removal / Replacement",null,null,"Asset Installations",null,null,"Completing the Letter"]
[]
["Tarriff Class Details","If assets are being removed / replaced",null,"Tarriff Class Details","If assets are being installed",null,"Front Page","Choose Council from pull down menu - cell A14"]
[null,"Click insert rows for the number of rows required",null,null,"Click insert rows for the number of rows required",null,null,"Council address and contact will populate automatically."]
[null,"Complete column A,C & D & E  - C = Removed, E = Commission date (or felled date if not known, or <1980 if not known), each component requires a separate row",null,null,"Complete column A,C & D & E  - C = Installed, E is year to be installed",null,"Optional","Otherwise overwrite manually"]
[null,"Annual charges removed calculates automatically - otherwise press F9.",null,null,"Annual charges removed calculates automatically - otherwise press F9.",null,"Optional","Choose macro \"restore Council auto-complete\" to reset formulas to auto-complete - this will overwrite existing data"]
[]
[null,"TARIFF CLASS 5 charges are calculated automatically - otherwise press F9",null,null,null,null,null,"Highlighted areas are editable - highlighting can be removed or restored using the macros provided."]
[null,"Sub-Totals will automatically transfer to:",null,null,"Sub-Totals will automatically transfer to:"]
[null,"Front Page",null,null,"Front Page",null,null,"Complete Project Number, Project Description, Drawing Number, Your Ref - if applicable"]
[]
[null,null,null,null,null,null,null,"Project Number and Project Description are transferred automatically to each of the detail sheets (TC 1 & 2, TC 3 & 4 and TC 6)"]
[]
[null,null,null,null,null,null,null,"Page 2 is a summary of data and provides for sign-off to be returned."]
[]
[null,null,null,null,null,null,null,"Note: if developer agrees to pay Tariff Class 5, they must complete the optional sign off box at the bottom of Page 3 - Front Page Letter."]
[]
[]
[]
[]
[]
[]
["TARIFF CLASSES"]
["LEGACY Rates – Tariff Class 1 & 2"]
["Assets constructed* up to (and including) 30 June 2009 will be charged in the same manner as the previous determination period, adjusted in accordance with the AER’s determination.  Adjustments have been made both for inflation and redistribution of the existing asset base across the asset classes in a way which more closely reflects the age of each asset class."]
["These rates are a continuation of rates previously listed under Schedule 1 & 2 and will no longer be available for assets constructed* from 1 July 2009."]
[]
["ANNUITY Rates – Tariff Class 3 & 4"]
["Applies to assets constructed* on or after 1 July 2009 and are cost reflective rates, recovered over the life of the asset."]
["Tariff Class 3 rates apply where IE provides installation capital."]
["Tariff Class 4 rates apply where IE does not fund the installation and the contestable assets are gifted to IE."]
[]
["RESIDUAL Capital Value – Tariff Class 5"]
["Applies where Endeavour has funded the capital, but the asset is replaced at the request of the customer before the end of its economic life. "]
["Using the AER’s approved method, the Tariff charge is calculated at the time of agreement using the replaced asset’s weighted average remaining life. "]
["The charge is paid at the time of replacement. "]
[]
["MAINTENANCE Only Rates – Unregulated Tariff Class"]
["In addition to the five (5) Tariff Classes detailed above, the Unregulated Tariff Class will apply where customers request limited maintenance only services to non-standard public lighting assets that they own and are responsible for. The rates are cost reflective for luminaire only requirements."]
["These rates were previously listed under Schedule 3."]
[]
["LEGEND"]
["INC","Incandescent"]
["FL","Flourescent"]
["CFL","Compact Flourescent"]
["M or MF","Mercury"]
["MH","Metal Halide"]
{"$rows_left_out":12}
{"sheet":"Page 3 - Front Page Letter","index":3,"n_rows":242,"n_cols":8,"rows_kept":242,"cut":false,"hidden":false,"merged":[[112,1,112,4],[29,0,29,1],[36,0,48,5],[67,0,67,5],[84,0,84,1],[87,0,87,5],[88,0,88,5],[95,1,95,4],[98,1,98,4],[102,0,102,5],[103,0,103,5],[106,1,106,4]]}
[]
[]
[]
[]
[]
["Version: July 2025"]
[null,"Project Number",null,null,null,null,"Highlighted sections should be completed"]
["PROJECT DESCRIPTION:","(Project Description)"]
["Drawing No:",1234567]
["YOUR REF:",1234567]
[]
[]
[]
["City of Parramatta"]
[{"$f":"VLOOKUP(A14,'Customer List'!A:D,2,FALSE)","v":"PO Box 32"}]
[{"$f":"VLOOKUP(A14,'Customer List'!A:D,3,FALSE)","v":"PARRAMATTA   NSW   2150"}]
[]
[{"$f":"TODAY()","v":"2025-07-21"}]
[]
["CHANGE IN PUBLIC LIGHTING SLUOS CHARGES"]
[]
["Tariff Class",null,null,null,"Net Change in Annual Charges (incl GST)","TARIFF CLASS 5 Charges (Residual Asset Value)"]
["1. LEGACY - Capital funded by Endeavour","Removed / Replaced",null,null,{"$f":"SUMIF('Page 4 - NOCC Detail'!B:B,MID(A23,1,1),'Page 4 - NOCC Detail'!H:H)","v":0},{"$f":"SUMIF('Page 4 - NOCC Detail'!B:B,MID(A23,1,1),'Page 4 - NOCC Detail'!K:K)","v":0}]
["2. LEGACY - Capital NOT funded by Endeavour","Removed / Replaced",null,null,{"$f":"SUMIF('Page 4 - NOCC Detail'!B:B,MID(A24,1,1),'Page 4 - NOCC Detail'!H:H)","v":0},{"$f":"SUMIF('Page 4 - NOCC Detail'!B:B,MID(A24,1,1),'Page 4 - NOCC Detail'!K:K)","v":0}]
["3. ANNUITY - Capital funded by Endeavour","to be installed/(replaced)",null,null,{"$f":"SUMIF('Page 4 - NOCC Detail'!B:B,MID(A25,1,1),'Page 4 - NOCC Detail'!H:H)","v":0},{"$f":"SUMIF('Page 4 - NOCC Detail'!B:B,MID(A25,1,1),'Page 4 - NOCC Detail'!K:K)","v":0}]
["4. ANNUITY - Capital NOT funded by Endeavour","to be installed/(replaced)",null,null,{"$f":"SUMIF('Page 4 - NOCC Detail'!B:B,MID(A26,1,1),'Page 4 - NOCC Detail'!H:H)","v":0},{"$f":"SUMIF('Page 4 - NOCC Detail'!B:B,MID(A26,1,1),'Page 4 - NOCC Detail'!K:K)","v":0}]
["6. Unregulated:CUSTOMER OWNED","Net Installations",null,null,{"$f":"SUMIF('Page 4 - NOCC Detail'!B:B,MID(A27,1,1),'Page 4 - NOCC Detail'!H:H)","v":0},{"$f":"SUMIF('Page 4 - NOCC Detail'!B:B,MID(A27,1,1),'Page 4 - NOCC Detail'!K:K)","v":0}]
["NET CHANGE in ANNUAL TARIFFS (incl GST)",null,null,null,{"$f":"SUM(E23:E27)","v":0},null,{"$f":"E28*2-SUM('Page 4 - NOCC Detail'!H:H)","v":0},{"$f":"IF(G28<>0,\"Tariff Class 5 Total Charge error - please check worksheet\",\"\")","v":""}]
[]
["ADDITIONAL: TARIFF CLASS 5 CHARGES",null,null,null,null,{"$f":"SUM(F23:F27)","v":0},{"$f":"F30*2-SUM('Page 4 - NOCC Detail'!K:K)","v":0},{"$f":"IF(G30<>0,\"Tariff Class 5 Total Charge error - please check worksheet\",\"\")","v":""}]
["One off charge paid at time of asset removal / replacement"]
["Applies to assets removed prior to the end of their useful life - single charge paid on removal."]
[]
[]
[]
["NOTES"]
[]
[]
[]
[]
[]
[]
[]
[]
[]
[]
[]
[]
[]
[]
["VALIDITY"]
["These rates will remain in force for 60 days."]
["At the expiry of 60 days from the date of this letter, rates may be amended to the rates in force at that time."]
[]
[]
["Yours faithfully,"]
[null,"Project / Manager - Designer"]
[null,"Title"]
[null,"Contact Details"]
[]
{"$rows_left_out":183}
{"sheet":"Page 4 - NOCC Detail","index":4,"n_rows":10,"n_cols":12,"rows_kept":10,"cut":false,"hidden":false,"merged":[[2,0,2,7],[4,2,4,4]]}
[]
["Endeavour Energy"]
["Public lighting tariffs effective from 1 July 2025",null,null,null,null,null,null,null,null,"Luminaire only"]
[]
["CUSTOMER: ",null,{"$f":"'Page 3 - Front Page Letter'!A14","v":"City of Parramatta"},"Bankstown City Council                  ","Bankstown City Council                  ",null,"PROJECT NUMBER:",{"$f":"'Page 3 - Front Page Letter'!B7","v":"Project Number"},null,"Luminaire & Support"]
[]
["Tariff Code: Description","Tariff Class","Installed/\nRemoved","Vertical Support Asset Number\n(Pole/Col/URD\n  If known )","Commisioned Date\n(select \"< 1987\" if unknown)","Annual\nCharges  \n$ Ex GST","GST $","Annual \nCharges  \n$ incl GST","Tariff Class 5 Charges\n$ ex GST","GST $","Tariff Class 5 Charges\n $ incl GST","Comments"]
[null,{"$f":"IF(ISBLANK(A8),\"\",VLOOKUP(A8,Lookups!$H$1:$I$399,2,FALSE))","v":""},null,null,null,{"$f":"IF(ISBLANK(A8),\"\",IF(C8=\"Removed\",-1,1)*SUMIF(Lookups!H:H,A8,Lookups!J:J))","v":""},{"$f":"IF(ISBLANK(A8),\"\",F8*0.1)","v":""},{"$f":"IF(ISBLANK(A8),\"\",G8+F8)","v":""},{"$f":"IF(OR(ISBLANK(A8),ISBLANK(C8),C8=\"Installed\"), \"\", IFERROR(VLOOKUP(A8, Lookups!H:AU, IF( OR(B8=1,B8=2), 4, VLOOKUP('Page 4 - NOCC Detail'!E8, Lookups!A:B, 2, FALSE) +3), FALSE), 0))","v":""},{"$f":"IF(I8=\"\",\"\",I8*0.1)","v":""},{"$f":"IF(I8=\"\",\"\",J8+I8)","v":""}]
[]
["Total",null,null,null,null,null,null,{"$f":"SUM(H8:H9)","v":0},null,null,{"$f":"SUM(K8:K9)","v":0}]

{"sheet":"Lookups","index":5,"n_rows":399,"n_cols":52,"rows_kept":399,"cut":false,"hidden":false,"merged":[]}
["Year",null,null,null,"Installed/Removed",13,"1 x 20 W Fluorescent","13: 1 x 20 W Fluorescent",1,50.98,4]
["<1988",38,{"$f":"1","v":1},null,"Installed",14,"2 x 20 W Fluorescent","14: 2 x 20 W Fluorescent",1,50.98,0]
[1989,37,{"$f":"C2+1","v":2},null,"Removed",18,"1 x 40 W Fluorescent","18: 1 x 40 W Fluorescent",1,50.98,10.039999999999999]
[1990,36,3,null,null,19,"2 x 40 W Fluorescent","19: 2 x 40 W Fluorescent",1,52.63,0]
[1991,35,4,null,null,20,"2 x 40 W Fluorescent","20: 2 x 40 W Fluorescent",1,52.63,0]
[1992,34,5,null,null,25,"400 W Sodium","25: 400 W Sodium",1,52.75,0]
[1993,33,6,null,null,30,"250W Mercury","30: 250W Mercury",1,53.47,2]
[1994,32,7,null,null,31,"400 W Mercury","31: 400 W Mercury",1,53.47,2.29]
[1995,31,8,null,null,33,"100W Sodium","33: 100W Sodium",1,53.34,0]
[1996,30,9,null,null,34,"90W Sodium","34: 90W Sodium",1,53.34,0]
[1997,29,10,null,null,35,"250W Sodium","35: 250W Sodium",1,54.97,0]
[1998,28,11,null,null,36,"400 W Sodium","36: 400 W Sodium",1,52.75,0]
[1999,27,12,null,null,38,"250W Sodium","38: 250W Sodium",1,54.97,3.18]
[2000,26,13,null,null,39,"310W Sodium","39: 310W Sodium",1,52.75,0]
[2001,25,14,null,null,40,"400 W Sodium","40: 400 W Sodium",1,52.75,0]
[2002,24,15,null,null,45,"400 W Sodium","45: 400 W Sodium",1,52.75,0]
[2003,23,16,null,null,53,"250W Sodium","53: 250W Sodium",1,54.97,0]
[2004,22,17,null,null,55,"250W Sodium","55: 250W Sodium",1,54.97,3.18]
[2005,21,18,null,null,56,"310W Sodium","56: 310W Sodium",1,52.75,0]
[2006,20,19,null,null,57,"400 W Sodium","57: 400 W Sodium",1,52.75,0]
[2007,19,20,null,null,60,"2 x 250W Mercury","60: 2 x 250W Mercury",1,69.52,0]
[2008,18,21,null,null,63,"1 x 40 W Fluorescent","63: 1 x 40 W Fluorescent",1,50.98,10.039999999999999]
[2009,17,22,null,null,70,"1 x 40 W Fluorescent","70: 1 x 40 W Fluorescent",1,50.98,10.039999999999999]
[2010,16,23,null,null,75,"2 x 40 W Fluorescent","75: 2 x 40 W Fluorescent",1,52.63,0]
[2011,15,24,null,null,88,"4 x 600W Sodium","88: 4 x 600W Sodium",1,67.400000000000006,0]
[2012,14,25,null,null,93,"80W Mercury","93: 80W Mercury",1,50.56,1.45]
[2013,13,26,null,null,94,"125W Mercury","94: 125W Mercury",1,53.47,1.87]
[2014,12,27,null,null,95,"250W Mercury","95: 250W Mercury",1,53.47,2]
[2015,11,28,null,null,96,"400 W Mercury","96: 400 W Mercury",1,53.47,2.29]
[2016,10,29,null,null,97,"125W Mercury","97: 125W Mercury",1,53.47,1.87]
[2017,9,30,null,null,98,"250W Mercury","98: 250W Mercury",1,53.47,2]
[2018,8,31,null,null,99,"400 W Mercury","99: 400 W Mercury",1,53.47,2.29]
[2019,7,32,null,null,100,"2 x 250W Mercury","100: 2 x 250W Mercury",1,69.52,266.91000000000003]
[2020,6,33,null,null,101,"2 x 250W Mercury","101: 2 x 250W Mercury",1,69.52,0]
[2021,5,{"$f":"C34+1","v":34},null,null,102,"2 x 400 W Sodium","102: 2 x 400 W Sodium",1,56.16,29.29]
[2022,4,35,null,null,103,"2 x 250W Sodium","103: 2 x 250W Sodium",1,60.6,10.029999999999999]
[2023,3,36,null,null,104,"80W Mercury","104: 80W Mercury",1,50.56,1.45]
[2024,2,37,null,null,112,"2 x 20 W Fluorescent","112: 2 x 20 W Fluorescent",1,50.98,0]
[2025,1,38,null,null,114,"250W Mercury","114: 250W Mercury",1,53.47,2]
[2026,1,39,null,null,115,"400 W Mercury","115: 400 W Mercury",1,53.47,2.29]
[null,null,40,null,null,119,"250W Sodium","119: 250W Sodium",1,54.97,3.18]
[null,null,41,null,null,121,"400 W Mercury","121: 400 W Mercury",1,53.47,2.29]
[null,null,42,null,null,122,"400 W Mercury","122: 400 W Mercury",1,53.47,2.29]
[null,null,43,null,null,123,"400 W Sodium","123: 400 W Sodium",1,52.75,0]
[null,null,44,null,null,130,"400 W Sodium","130: 400 W Sodium",1,52.75,0]
[null,null,45,null,null,131,"125W Mercury","131: 125W Mercury",1,53.47,1.87]
[null,null,46,null,null,132,"250W Mercury","132: 250W Mercury",1,53.47,2]
[null,null,47,null,null,134,"250W Sodium","134: 250W Sodium",1,54.97,3.18]
[null,null,48,null,null,135,"2 x 400 W Sodium","135: 2 x 400 W Sodium",1,56.16,0]
[null,null,49,null,null,136,"2 x 400 W Sodium","136: 2 x 400 W Sodium",1,56.16,29.29]
[null,null,{"$f":"C49+1","v":49},null,null,140,"250W Sodium","140: 250W Sodium",1,54.97,3.18]
[null,null,{"$f":"C50+1","v":50},null,null,141,"250W Sodium","141: 250W Sodium",1,54.97,3.18]
[null,null,51,null,null,142,"150W Sodium","142: 150W Sodium",1,52.07,14.45]
[null,null,52,null,null,143,"150W Sodium","143: 150W Sodium",1,52.07,14.45]
[null,null,53,null,null,145,"4 x 600W Sodium","145: 4 x 600W Sodium",1,67.400000000000006,0]
[null,null,54,null,null,146,"2 x 400 W Sodium","146: 2 x 400 W Sodium",1,56.16,0]
[null,null,55,null,null,147,"80W Mercury","147: 80W Mercury",1,50.56,1.45]
[null,null,56,null,null,149,"80W Mercury","149: 80W Mercury",1,50.56,1.45]
[null,null,57,null,null,150,"120W Sodium","150: 120W Sodium",1,52.07,6.27]
[null,null,58,null,null,151,"2 x 400 W Sodium","151: 2 x 400 W Sodium",1,56.16,0]
{"$rows_left_out":340}
{"sheet":"Customer List","index":6,"n_rows":35,"n_cols":4,"rows_kept":35,"cut":false,"hidden":true,"merged":[]}
["Customer","Address","Suburb","Attention"]
["Bankstown City Council                  ","PO Box 8","BANKSTOWN NSW 1885","Manager of Roads & Infratructure"]
["Blacktown City Council                  ","PO Box 63","BLACKTOWN   NSW   2148","Mr Andy Karklins"]
["Blue Mountains City Council             ","Locked Bag 1005","KATOOMBA   NSW   2780","Mr Alan Cattermole"]
["Camden City Council","PO Box 183","CAMDEN   NSW   2570","Mr Adam Wilkinson"]
["Campbelltown City Council               ","PO Box 57","CAMPBELLTOWN   NSW   2560","Holly Sutherland"]
["Council of the City of Shellharbour ","PO Box 155","SHELLHARBOUR CITY CENTRE   NSW   2529","Mr Max Boenisch"]
["Cumberland City Council","PO Box 42","MERRYLANDS NSW 2160","Finance Manager"]
["Bathurst Regional Council","Private Mail Bag 17","BATHURST NSW 2795","Mr David Sherley "]
["Fairfield City Council                  ","PO Box 21","FAIRFIELD NSW 1860","Mr David Niven"]
["Hawkesbury City Council                 ","PO Box 146","WINDSOR   NSW   2756","Accounts Payable"]
["HMAS Albatross (Department of Defence)","CP26157 Campbell Park Offices","CANBERRA ACT 2600","ENERGY SERVICES"]
["Hornsby City Council","PO Box 37","HORNSBY NSW 2077","Mr Alan Boyd"]
["Kiama Municipal Council                 ","PO Box 75","KIAMA NSW 2533","Accounts Payable"]
["Lithgow City Council","PO Box 19","LITHGOW NSW 2790","Mr Iain Stewart"]
["Liverpool City Council                  ","PO Box 64","LIVERPOOL  NSW  2170","Bozenab Blasko"]
["Mid Western Regional Council","PO Box 156","MUDGEE   NSW   2850","Accounts Payable"]
["NSW Maritime Property Divisions","Locked Bag 5100","CAMPERDOWN   NSW   1450","Patrick McCallum\nPrincipal Engineer"]
["City of Parramatta","PO Box 32","PARRAMATTA   NSW   2150","Mr Andy Ling"]
["Penrith City Council                    ","PO Box 60","PENRITH NSW 2751","Mr Murray Halls"]
["Port Kembla Operations Pty Ltd","PO Box 89","PORT KEMBLA NSW 2505","Accounts Payable"]
["RTA, Traffic Asset Services (Corrimal)","L9 Sydney Project Services. 27 Argyle St","PARRAMATTA NSW 2150","Mr Harbans Puria"]
["RTA, Traffic Asset Services\n(M7)","L9 Sydney Project Services. 27 Argyle St","PARRAMATTA NSW 2150","Mr Harbans Puria"]
["RTA, Traffic Asset Services\n(Parkes)","L9 Sydney Project Services. 27 Argyle St","PARRAMATTA NSW 2150","Mr Harbans Puria"]
["RTA, Traffic Asset Services\n(National Highway)","L9 Sydney Project Services. 27 Argyle St","PARRAMATTA NSW 2150","Mr Harbans Puria"]
["RTA, Traffic Asset Services\n(State Roads)","L9 Sydney Project Services. 27 Argyle St","PARRAMATTA NSW 2150","Mr Harbans Puria"]
["RTA (Unmetered Lighting)","L9 Sydney Project Services. 27 Argyle St","PARRAMATTA NSW 2150","Mr Harbans Puria"]
["Ryde City Council                  ","Locked Bag 2069","NORTH RYDE   NSW   1670","Accounts Payable"]
["Shoalhaven City Council                 ","PO Box 42","NOWRA NSW 2541","Mr Bill Galea"]
["Sydney Catchment Authority","PO Box 323","PENRITH NSW 2751","Mr Imran Bashir"]
["The Hills Shire Council","3 Columbia Court","BAULKHAM HILLS 2153","Ms Bev Osbourne"]
["The Department of Lands","PO Box 309","NOWRA NSW 2541","Ms Cindy Garner"]
["Wingecarribee Shire Council             ","PO Box 141","MOSS VALE   NSW   2577","Mr Rod Smith"]
["Wollondilly Shire Council               ","PO Box 21","PICTON   NSW   2571","Mr Charles Dunlop"]
["Wollongong City Council                 ","Locked Bag 8821","WOLLONGONG   NSW   2500","Ms Sonia Batziavalis"]

{"sheet":"Template","index":7,"n_rows":1,"n_cols":11,"rows_kept":1,"cut":false,"hidden":false,"merged":[]}
[null,{"$f":"IF(ISBLANK(A1),\"\",VLOOKUP(A1,Lookups!$H$1:$I$399,2,FALSE))","v":""},null,null,null,{"$f":"IF(ISBLANK(A1),\"\",IF(C1=\"Removed\",-1,1)*SUMIF(Lookups!H:H,A1, Lookups!J:J))","v":""},{"$f":"IF(ISBLANK(A1),\"\",F1*0.1)","v":""},{"$f":"IF(ISBLANK(A1),\"\",G1+F1)","v":""},{"$f":"IF(OR(ISBLANK(A1),ISBLANK(C1),C1=\"Installed\"), \"\", IFERROR(VLOOKUP(A1,Lookups!H:AU, IF(OR(B1=1,B1=2), 4, VLOOKUP('Page 4 - NOCC Detail'!E1,Lookups!A:B,2,FALSE) +3), FALSE), 0))","v":""},{"$f":"IF(I1=\"\",\"\",I1*0.1)","v":""},{"$f":"IF(I1=\"\",\"\",J1+I1)","v":""}]

{"sheet":"FY26 Staging","index":8,"n_rows":398,"n_cols":6,"rows_kept":398,"cut":false,"hidden":true,"merged":[]}
["Tariff Code","Tariff Description","Display Tariff","Annual Charge","Tariff Class","TC5"]
[13,"1 x 20 W Fluorescent",{"$f":"A2&\": \" &B2","v":"13: 1 x 20 W Fluorescent"},50.98,1,4]
[14,"2 x 20 W Fluorescent","14: 2 x 20 W Fluorescent",50.98,1,0]
[18,"1 x 40 W Fluorescent","18: 1 x 40 W Fluorescent",50.98,1,10.039999999999999]
[19,"2 x 40 W Fluorescent","19: 2 x 40 W Fluorescent",52.63,1,0]
[20,"2 x 40 W Fluorescent","20: 2 x 40 W Fluorescent",52.63,1,0]
[25,"400 W Sodium","25: 400 W Sodium",52.75,1,0]
[30,"250W Mercury","30: 250W Mercury",53.47,1,2]
[31,"400 W Mercury","31: 400 W Mercury",53.47,1,2.29]
[33,"100W Sodium","33: 100W Sodium",53.34,1,0]
[34,"90W Sodium","34: 90W Sodium",53.34,1,0]
[35,"250W Sodium","35: 250W Sodium",54.97,1,0]
[36,"400 W Sodium","36: 400 W Sodium",52.75,1,0]
[38,"250W Sodium","38: 250W Sodium",54.97,1,3.18]
[39,"310W Sodium","39: 310W Sodium",52.75,1,0]
[40,"400 W Sodium","40: 400 W Sodium",52.75,1,0]
[45,"400 W Sodium","45: 400 W Sodium",52.75,1,0]
[53,"250W Sodium","53: 250W Sodium",54.97,1,0]
[55,"250W Sodium","55: 250W Sodium",54.97,1,3.18]
[56,"310W Sodium","56: 310W Sodium",52.75,1,0]
[57,"400 W Sodium","57: 400 W Sodium",52.75,1,0]
[60,"2 x 250W Mercury","60: 2 x 250W Mercury",69.52,1,0]
[63,"1 x 40 W Fluorescent","63: 1 x 40 W Fluorescent",50.98,1,10.039999999999999]
[70,"1 x 40 W Fluorescent","70: 1 x 40 W Fluorescent",50.98,1,10.039999999999999]
[75,"2 x 40 W Fluorescent","75: 2 x 40 W Fluorescent",52.63,1,0]
[88,"4 x 600W Sodium","88: 4 x 600W Sodium",67.400000000000006,1,0]
[93,"80W Mercury","93: 80W Mercury",50.56,1,1.45]
[94,"125W Mercury","94: 125W Mercury",53.47,1,1.87]
[95,"250W Mercury","95: 250W Mercury",53.47,1,2]
[96,"400 W Mercury","96: 400 W Mercury",53.47,1,2.29]
[97,"125W Mercury","97: 125W Mercury",53.47,1,1.87]
[98,"250W Mercury","98: 250W Mercury",53.47,1,2]
[99,"400 W Mercury","99: 400 W Mercury",53.47,1,2.29]
[100,"2 x 250W Mercury","100: 2 x 250W Mercury",69.52,1,266.91000000000003]
[101,"2 x 250W Mercury","101: 2 x 250W Mercury",69.52,1,0]
[102,"2 x 400 W Sodium","102: 2 x 400 W Sodium",56.16,1,29.29]
[103,"2 x 250W Sodium","103: 2 x 250W Sodium",60.6,1,10.029999999999999]
[104,"80W Mercury","104: 80W Mercury",50.56,1,1.45]
[112,"2 x 20 W Fluorescent","112: 2 x 20 W Fluorescent",50.98,1,0]
[114,"250W Mercury","114: 250W Mercury",53.47,1,2]
[115,"400 W Mercury","115: 400 W Mercury",53.47,1,2.29]
[119,"250W Sodium","119: 250W Sodium",54.97,1,3.18]
[121,"400 W Mercury","121: 400 W Mercury",53.47,1,2.29]
[122,"400 W Mercury","122: 400 W Mercury",53.47,1,2.29]
[123,"400 W Sodium","123: 400 W Sodium",52.75,1,0]
[130,"400 W Sodium","130: 400 W Sodium",52.75,1,0]
[131,"125W Mercury","131: 125W Mercury",53.47,1,1.87]
[132,"250W Mercury","132: 250W Mercury",53.47,1,2]
[134,"250W Sodium","134: 250W Sodium",54.97,1,3.18]
[135,"2 x 400 W Sodium","135: 2 x 400 W Sodium",56.16,1,0]
[136,"2 x 400 W Sodium","136: 2 x 400 W Sodium",56.16,1,29.29]
[140,"250W Sodium","140: 250W Sodium",54.97,1,3.18]
[141,"250W Sodium","141: 250W Sodium",54.97,1,3.18]
[142,"150W Sodium","142: 150W Sodium",52.07,1,14.45]
[143,"150W Sodium","143: 150W Sodium",52.07,1,14.45]
[145,"4 x 600W Sodium","145: 4 x 600W Sodium",67.400000000000006,1,0]
[146,"2 x 400 W Sodium","146: 2 x 400 W Sodium",56.16,1,0]
[147,"80W Mercury","147: 80W Mercury",50.56,1,1.45]
[149,"80W Mercury","149: 80W Mercury",50.56,1,1.45]
[150,"120W Sodium","150: 120W Sodium",52.07,1,6.27]
{"$rows_left_out":339}
{"sheet":"temp6","index":9,"n_rows":31,"n_cols":4,"rows_kept":31,"cut":false,"hidden":true,"merged":[]}
[716,"2x14W Energy Efficient Fluro - STD",57.39,6]
[717,"2x24W Energy Efficient Fluro - STD",57.39,6]
[718,"1x42W Compact Fluorescent - STD",59.53,6]
[725,"50W Mercury - STANDARD",61.05,6]
[710,"80W Mercury - STANDARD",57.98,6]
[726,"70W Sodium - STANDARD",63.69,6]
[727,"100W Sodium - STANDARD",68.14,6]
[728,"100W Metal Halide - STANDARD",90.19,6]
[729,"150W Sodium - STANDARD",63.5,6]
[721,"150W Metal Halide - STANDARD",78.64,6]
[720,"250W Sodium - STANDARD",74.040000000000006,6]
[722,"250W Metal Halide - STANDARD",75.63,6]
[731,"400W Sodium - STANDARD",65.97,6]
[732,"80W Mercury - AEROSCREEN",88.79,6]
[733,"150W Sodium - AEROSCREEN",63.5,6]
[734,"150W Metal Halide - AEROSCREEN",78.64,6]
[735,"250W Sodium (w/o PECB) - AEROSCREEN",74.040000000000006,6]
[736,"250W Metal Halide - AEROSCREEN",75.63,6]
[737,"400W Sodium - AEROSCREEN",65.97,6]
[715,"400W Metal Halide - AEROSCREEN",74.069999999999993,6]
[738,"80W Mercury - POST TOP",57.98,6]
[739,"250W Sodium - FLOODLIGHT",74.040000000000006,6]
[740,"250W Metal Halide - FLOODLIGHT",75.63,6]
[741,"400W Sodium - FLOODLIGHT",65.97,6]
[742,"400W Metal Halide - FLOODLIGHT",74.069999999999993,6]
[795,"Column (Steel) - Minor <=9m",22.09,6]
[796,"Column (Steel) - Major >9m",22.09,6]
[790,"Outreach - Minor (<2m)       ",0,6]
[791,"Outreach - Major (>2m)",0,6]
[792,"Bracket - Minor (<3m)",0,6]
[793,"Bracket - Major (>3m)",0,6]