{"text_format":"1","workbook":"xlsx","n_sheets":12,"sheets":["Examples","Instructions","Questionnaire","Adoption profile","Results","Value added baseline","prod sims","Sets","Sheet7","Sheet8","Sheet9","Sheet10"],"not_rendered":{"charts":18,"images":2,"macros":1,"external_links":0,"defined_names":0,"comments":0,"pivot_tables":0},"unopened":[],"bounds":{"document_bytes":16777216,"sheet_cells":100000,"rows_first":2000,"rows_last":500,"rows_between":2000,"halvings":0,"cell_chars":16384,"cell_head_chars":4096},"cells_cut":0,"cells_raw":0,"read":"whole","date_system":"1900"}

{"sheet":"Examples","index":0,"n_rows":22,"n_cols":27,"rows_kept":22,"cut":false,"hidden":true,"merged":[]}
[null,"Teal","Red","Light grey","Mid-grey","Grey","Light teal","Mid-red","Light red",null,null,"Teal solid","Red  solid","Mid-grey","Teal dashes","Red  dashes","Grey dashes",null,"X value","1st Y value","2nd Y value",null,null,"Teal","Red","Mid-red","Mid-grey"]
["2003-04",36.19,36.880000000000003,21.56,5.36,3.01,10,3.01,10,null,"2003-04",33.19,36.880000000000003,21.56,5.36,3.01,10,null,1.8,10,17,null,"2003-04",33.19,36.880000000000003,21.56,5.36]
["2004-05",39.39,32.020000000000003,21.6,7.01,3.36,12,3.36,12,null,"2004-05",39.39,32.020000000000003,21.6,7.01,3.36,12,null,2.2999999999999998,12,9,null,"2004-05",39.39,32.020000000000003,21.6,7.01]
["2005-06",42.78,29.91,18.350000000000001,6.33,2.63,14,2.63,14,null,"2005-06",42.78,29.91,18.350000000000001,6.33,2.63,14,null,3.7,16,14,null,"2005-06",42.78,29.91,18.350000000000001,6.33]
["2006-07",42.13,26.53,21.6,7.01,2.72,16,2.72,16,null,"2006-07",42.13,26.53,21.6,7.01,2.72,16,null,4.0999999999999996,8,23,null,"2006-07",42.13,26.53,21.6,7.01]
["2007-08",41.69,24.76,23.98,7,2.57,18,2.57,18,null,"2007-08",41.69,24.76,23.98,7,2.57,18,null,5.5,14,27,null,"2007-08",41.69,24.76,23.98,7]
["2008-09",39.39,32.020000000000003,21.6,7.01,3.36,12,3.36,12,null,"2008-09",39.39,32.020000000000003,21.6,7.01,3.36,12,null,null,null,null,null,"2008-09",39.39,32.020000000000003,21.6,7.01]
["2009-10",42.13,26.53,21.6,7.01,2.72,16,2.72,16,null,"2009-10",42.13,26.53,21.6,7.01,2.72,16,null,null,null,null,null,"2009-10",42.13,26.53,21.6,7.01]
["2010-11",45,22,26,8,2,20,2,20,null,"2010-11",45,22,26,8,2,20,null,null,null,null,null,"2010-11",45,22,26,8]
[]
{"$rows_left_out":13}
{"sheet":"Instructions","index":1,"n_rows":21,"n_cols":4,"rows_kept":21,"cut":false,"hidden":false,"merged":[[8,2,8,8]]}
[]
[]
[]
[]
[]
[]
[]
[]
[null,null,"ESTIMATING PRODUCTIVITY GROWTH AND VALUE ADDED OUTCOMES "]
[null,null,"Note: This spreadsheet contains macros, please ensure macros are enabled on your system for full functionality"]
{"$rows_left_out":12}
{"sheet":"Questionnaire","index":2,"n_rows":36,"n_cols":4,"rows_kept":36,"cut":false,"hidden":false,"merged":[]}
[]
["Provide a score for each of the factors listed"]
[]
["Driver","Question","Score (1–5)"]
["Factors determining the maximum adoption rate"]
["Technical fit / agronomic compatibility","How many businesses  in your industry meet the agronomic or technical pre‑conditions for adopting the technology (1 = a few, 5 =  most or all)?",4]
["Capital intensity vs. business size","Relative to annual revenue, how high is the upfront capital cost of adopting (1 = negligible, 5 = prohibitively high)?",1]
["Complementary infrastructure","Are the necessary complementary services (e.g., broadband, cold‑chain, specialist technicians) widely available (1 = not available, 5 = widely available)?",5]
["Regulation & certification","Do regulations, licences or certification schemes materially restrict uptake (1 = not at all, 5 = very restrictive)?",1]
["Strategic substitutes","Are there low‑cost substitute technologies that can deliver comparable benefits (1 = none, 5 = many strong substitutes)?",1]
{"$rows_left_out":27}
{"sheet":"Adoption profile","index":3,"n_rows":68,"n_cols":14,"rows_kept":68,"cut":false,"hidden":false,"merged":[]}
[]
["Choose Horticulture sector:",null,"Apples",null,"(Drop down menu)"]
["Choose type of productivity:",null,"Multifactor productivity",null,"(Drop down menu)"]
[]
[null,"Scenario 1","(Choose values for darker grey cells that are bold)",null,null,null,null,null,"Scenario 2","(Choose values for darker grey cells that are bold)"]
[null,"Source","Additional productivity with full (%) adoption (input value)","Maximum adoption (input value)","Year when the adoption achieves half of the maximum adoption rate (input value)","Speed to reach maximim adoption (choose from drop down menu)","For reference: Implied midpoint year if initial adoption is 1% in 2025",null,"Source","Additional productivity with full (%) adoption (input value)","Maximum adoption (input value)","Year when the adoption achieves half of the maximum adoption rate (input value)","Speed to reach maximim adoption (choose from drop down menu)","For reference: Implied midpoint year if initial adoption is 1% in 2025"]
[null,null,"%pa","%","Year",null,null,null,null,"%pa","%","Year"]
[null,"Production cost analysis",0.1,0.9,2026,"Quick",{"$f":"1/INDEX(Sets!$C$8:$C$12,MATCH('Adoption profile'!F8,Sets!$B$8:$B$12,))*LN('Adoption profile'!D8/(1%)-1)+2025","v":2030.9848484929762},null,{"$f":"B8","v":"Production cost analysis"},0.12,0.5,2033,"Normal",{"$f":"1/INDEX(Sets!$C$8:$C$12,MATCH('Adoption profile'!M8,Sets!$B$8:$B$12,))*LN('Adoption profile'!K8/(1%)-1)+2025","v":2032.7836405962212}]
[null,"Automated farm data collection",0.12,0.63,2033,"Normal",{"$f":"1/INDEX(Sets!$C$8:$C$12,MATCH('Adoption profile'!F9,Sets!$B$8:$B$12,))*LN('Adoption profile'!D9/(1%)-1)+2025","v":2033.2542687700902},null,{"$f":"B9","v":"Automated farm data collection"},0.12,0.63,2033,"Quick",{"$f":"1/INDEX(Sets!$C$8:$C$12,MATCH('Adoption profile'!M9,Sets!$B$8:$B$12,))*LN('Adoption profile'!K9/(1%)-1)+2025","v":2030.5028458467268}]
[null,"ML and AI",7.0000000000000007E-2,0.56000000000000005,2033,"Normal",{"$f":"1/INDEX(Sets!$C$8:$C$12,MATCH('Adoption profile'!F10,Sets!$B$8:$B$12,))*LN('Adoption profile'!D10/(1%)-1)+2025","v":2033.014666370465},null,"ML and AI",0.02,0.56000000000000005,2031,"Quick",{"$f":"1/INDEX(Sets!$C$8:$C$12,MATCH('Adoption profile'!M10,Sets!$B$8:$B$12,))*LN('Adoption profile'!K10/(1%)-1)+2025","v":2030.3431109136434}]
{"$rows_left_out":59}
{"sheet":"Results","index":4,"n_rows":45,"n_cols":23,"rows_kept":45,"cut":false,"hidden":false,"merged":[]}
[]
[null,"Value added outcomes (in $m)",null,null,"(Do not alter these cells)"]
[null,{"$f":"'Adoption profile'!$C$2","v":"Apples"},null,null,null,null,null,null,null,null,null,null,null,null,null,null,null,null,null,null,"Do not alter these cells"]
[null,null,2025,{"$f":"C4+1","v":2026},{"$f":"D4+1","v":2027},2028,2029,2030,2031,2032,2033,2034,2035,2036,2037,2038,2039,{"$f":"Q4+1","v":2040}]
[null,"Baseline",{"$f":"INDEX('Value added baseline'!$D$11:$W$58,MATCH(Results!$B$3,'Value added baseline'!$C$11:$C$58,),MATCH(Results!C$4,'Value added baseline'!$D$10:$W$10,))","v":502.68226738701833},{"$f":"INDEX('Value added baseline'!$D$11:$W$58,MATCH(Results!$B$3,'Value added baseline'!$C$11:$C$58,),MATCH(Results!D$4,'Value added baseline'!$D$10:$W$10,))","v":510.45026945854289},{"$f":"INDEX('Value added baseline'!$D$11:$W$58,MATCH(Results!$B$3,'Value added baseline'!$C$11:$C$58,),MATCH(Results!E$4,'Value added baseline'!$D$10:$W$10,))","v":518.52589546275078},{"$f":"INDEX('Value added baseline'!$D$11:$W$58,MATCH(Results!$B$3,'Value added baseline'!$C$11:$C$58,),MATCH(Results!F$4,'Value added baseline'!$D$10:$W$10,))","v":529.30716113533913},{"$f":"INDEX('Value added baseline'!$D$11:$W$58,MATCH(Results!$B$3,'Value added baseline'!$C$11:$C$58,),MATCH(Results!G$4,'Value added baseline'!$D$10:$W$10,))","v":540.57304878074115},{"$f":"INDEX('Value added baseline'!$D$11:$W$58,MATCH(Results!$B$3,'Value added baseline'!$C$11:$C$58,),MATCH(Results!H$4,'Value added baseline'!$D$10:$W$10,))","v":552.38766976017996},{"$f":"INDEX('Value added baseline'!$D$11:$W$58,MATCH(Results!$B$3,'Value added baseline'!$C$11:$C$58,),MATCH(Results!I$4,'Value added baseline'!$D$10:$W$10,))","v":564.15391987427881},{"$f":"INDEX('Value added baseline'!$D$11:$W$58,MATCH(Results!$B$3,'Value added baseline'!$C$11:$C$58,),MATCH(Results!J$4,'Value added baseline'!$D$10:$W$10,))","v":575.79502929686578},{"$f":"INDEX('Value added baseline'!$D$11:$W$58,MATCH(Results!$B$3,'Value added baseline'!$C$11:$C$58,),MATCH(Results!K$4,'Value added baseline'!$D$10:$W$10,))","v":587.36134935784139},{"$f":"INDEX('Value added baseline'!$D$11:$W$58,MATCH(Results!$B$3,'Value added baseline'!$C$11:$C$58,),MATCH(Results!L$4,'Value added baseline'!$D$10:$W$10,))","v":598.85451244863691},{"$f":"INDEX('Value added baseline'!$D$11:$W$58,MATCH(Results!$B$3,'Value added baseline'!$C$11:$C$58,),MATCH(Results!M$4,'Value added baseline'!$D$10:$W$10,))","v":610.27944248486665},{"$f":"INDEX('Value added baseline'!$D$11:$W$58,MATCH(Results!$B$3,'Value added baseline'!$C$11:$C$58,),MATCH(Results!N$4,'Value added baseline'!$D$10:$W$10,))","v":621.64376548272082},{"$f":"INDEX('Value added baseline'!$D$11:$W$58,MATCH(Results!$B$3,'Value added baseline'!$C$11:$C$58,),MATCH(Results!O$4,'Value added baseline'!$D$10:$W$10,))","v":632.95609161479297},{"$f":"INDEX('Value added baseline'!$D$11:$W$58,MATCH(Results!$B$3,'Value added baseline'!$C$11:$C$58,),MATCH(Results!P$4,'Value added baseline'!$D$10:$W$10,))","v":644.22667699169824},{"$f":"INDEX('Value added baseline'!$D$11:$W$58,MATCH(Results!$B$3,'Value added baseline'!$C$11:$C$58,),MATCH(Results!Q$4,'Value added baseline'!$D$10:$W$10,))","v":655.46581329362516},{"$f":"INDEX('Value added baseline'!$D$11:$W$58,MATCH(Results!$B$3,'Value added baseline'!$C$11:$C$58,),MATCH(Results!R$4,'Value added baseline'!$D$10:$W$10,))","v":666.68213245155493},null,null,null,{"$f":"FLOOR(MIN(C5:R7),W6)","v":500}]
[null,"Scenario 1",{"$f":"C$5*(1+C12/100)","v":520.10458503428163},{"$f":"D$5*(1+D12/100)","v":537.89056034802854},556.98103035317229,578.41949246356501,599.62186295908134,621.3492764668872,643.5960051244034,666.4390251543133,689.55725756698234,712.21173448304455,733.66286435069333,753.49762412036023,771.70587349457696,788.54279757266545,804.34834714388046,819.43284945872972,null,null,{"$f":"MIN(C5:R7)","v":502.68226738701833},{"$f":"MAX(C5:R7)","v":819.43284945872972},{"$f":"IF(U6<100,10,100)","v":100}]
[null,"Scenario 2",{"$f":"C$5*(1+C13/100)","v":504.47959189945499},513.3626113129327,523.2549065360123,536.97364414816059,552.83441859719198,571.57974447193862,593.21465885286227,617.76479240447782,644.22118212386363,670.2773246069894,693.79461120913436,714.13684749350659,731.8415384487904,747.733450454955,762.48395247198437,776.54247314599058]
[]
["Productivity improvement %","Scenario 1",{"$f":"TRANSPOSE('Adoption profile'!$G$53:$G$68)*100","v":3.3912374634695492},5.3037798633522719,7.3721653699779202,9.2832725641570502,10.990263782410654,12.627412154698872,14.320691766448585,16.101034022356991,17.897910815437061,19.576304059460877,21.004662824603681,22.114870556114656,22.914295797768911,23.457531599120848,23.81195753941866,24.0370117941312]
[null,"Scenario 2",{"$f":"TRANSPOSE('Adoption profile'!N53:N68)*100","v":0.32476820763501929},0.53311934800485616,0.867676036637133,1.3945558796907458,2.2030483585736853,3.3997149543989655,5.0778108496405681,7.2424267077428519,9.6987408800113073,12.040508393335909,13.898244992793055,15.172676858940326,15.972122525557802,16.451229248168833,16.732696127266934,16.896955128987202]
{"$rows_left_out":36}
{"sheet":"Value added baseline","index":5,"n_rows":88,"n_cols":23,"rows_kept":88,"cut":false,"hidden":true,"merged":[]}
[null,null,null,"Value added ($m)"]
[]
[null,null,"farming",{"$f":"SUM(D11:D52)","v":9611.2887253166209},9313.5763229005424,{"$f":"SUM(F11:F52)","v":9583.0685866789954},9866.1923462621908,10105.177185716006,10384.481699827142,10656.800955342625,11005.968084746617,11366.378817236002,11738.578899410797,12117.880108174419,12491.998886886069,12863.461467675121,13233.034585599247,13601.209309831378,13968.231520805028,14334.109779082923,14698.772295639981,15062.13811864243,15424.210321435266]
[null,null,null,null,{"$f":"E3/D3-1","v":-3.0975284472714804E-2},{"$f":"F3/E3-1","v":2.8935422273377087E-2},{"$f":"G3/F3-1","v":2.9544165005429779E-2},2.4222600884560519E-2,2.7639744358559204E-2,2.6223673302830042E-2,3.2764722815709746E-2,3.2746845140218417E-2,3.2745704516762286E-2,3.2312361829647029E-2,3.0873286034516889E-2,2.9736040176805423E-2,2.8730456328013743E-2,2.7822395675803246E-2,2.6984527817563553E-2,2.6193599220698527E-2,2.5440192811219564E-2,2.4720828086453928E-2,2.4038566101362457E-2]
[null,null,"processing",{"$f":"SUM(D53:D58)","v":547.05288152533421},518.2597242141419,{"$f":"SUM(F53:F58)","v":504.91439983280287},520.49228931789526,532.32539577370471,532.91522958342409,531.3112394326447,589.99096717867849,646.86799080157232,702.68791206004403,755.45585209799094,804.453611980912,850.23986411032001,893.21933377633547,933.77491648973762,972.2531291433786,1008.9472448256141,1044.1036471783605,1077.9195957991949,1110.5465409300646]
[null,null,null,null,{"$f":"E5/D5-1","v":-5.2633224837257186E-2},{"$f":"F5/E5-1","v":-2.5750263348314539E-2},{"$f":"G5/F5-1","v":3.0852535578804741E-2},2.2734451016203749E-2,1.1080324448209389E-3,-3.00984108116642E-3,0.11044322685267183,9.6403210874360212E-2,8.6292600734969138E-2,7.5094418350315939E-2,6.485853507766004E-2,5.6915963142563974E-2,5.054981715187945E-2,4.5403834399712295E-2,4.1207160284717048E-2,3.7741319191809231E-2,3.4844638838200881E-2,3.2387539984388036E-2,3.0268440482964953E-2]
[null,null,"total",{"$f":"SUM(D3,D5)","v":10158.341606841956},9831.8360471146843,{"$f":"SUM(F3,F5)","v":10087.982986511799},10386.684635580086,10637.502581489711,10917.396929410566,11188.112194775271,11595.959051925296,12013.246808037575,12441.266811470841,12873.33596027241,13296.452498866982,13713.70133178544,14126.253919375582,14534.984226321116,14940.484649948407,15343.057023908537,15742.875942818342,16140.057714441624,16534.756862365331]
[null,null,null,null,{"$f":"E7/D7-1","v":-3.214162039080859E-2},{"$f":"F7/E7-1","v":2.605280826181855E-2},{"$f":"G7/F7-1","v":2.9609650360004292E-2},2.4148027470713318E-2,2.6312035722360072E-2,2.4796686162011694E-2,3.6453590208050057E-2,3.5985618286828558E-2,3.5629002739450577E-2,3.4728710134501961E-2,3.2867668481606049E-2,3.1380462792915065E-2,3.0083241395518323E-2,2.8934090331260265E-2,2.789823623564569E-2,2.6945067940719047E-2,2.6058621713181518E-2,2.5229302007202081E-2,2.4454630516627107E-2]
[]
[null,null,null,2021,{"$f":"D10+1","v":2022},{"$f":"E10+1","v":2023},{"$f":"F10+1","v":2024},2025,2026,2027,2028,2029,2030,2031,2032,2033,2034,2035,2036,2037,2038,2039,2040]
{"$rows_left_out":79}
{"sheet":"prod sims","index":6,"n_rows":58,"n_cols":43,"rows_kept":58,"cut":false,"hidden":true,"merged":[]}
[]
[]
[]
[]
[]
[]
[null,null,null,null,null,null,null,null,null,null,null,null,null,null,null,null,null,null,null,null,null,null,null,null,null,null,null,null,null,null,null,null,null,null,null,null,null,null,null,null,"Used parameters"]
[null,null,null,null,"Generic productivity",null,null,null,null,null,"x","x2",null,null,null,null,null,null,null,null,null,null,null,"Labour productivity",null,null,null,null,null,"x","x2",null,null,null,null,null,null,null,null,null,"x","x2"]
[null,null,null,null,{"$f":"E10^2","v":1},{"$f":"F10^2","v":4},{"$f":"G10^2","v":25},{"$f":"H10^2","v":100},{"$f":"I10^2","v":225},null,"b","a","c",null,null,null,null,null,null,null,null,null,null,{"$f":"X10^2","v":1},{"$f":"Y10^2","v":4},25,100,225,null,"b","a","c",null,null,null,null,null,null,null,null,"b","a","c"]
[null,null,null,null,1,2,5,10,15,null,null,null,null,null,null,null,null,null,null,null,null,null,null,1,2,5,10,15]
{"$rows_left_out":49}
{"sheet":"Sets","index":7,"n_rows":25,"n_cols":15,"rows_kept":25,"cut":false,"hidden":true,"merged":[]}
[]
[]
[null,"Multifactor productivity"]
[null,"Labour productivity"]
[]
[]
[null,"Speed parameters"]
[null,"Very quick",1]
[null,"Quick",0.75]
[null,"Normal",0.5]
{"$rows_left_out":16}
{"sheet":"Sheet7","index":8,"n_rows":0,"n_cols":0,"rows_kept":0,"cut":false,"hidden":true,"merged":[]}

{"sheet":"Sheet8","index":9,"n_rows":0,"n_cols":0,"rows_kept":0,"cut":false,"hidden":false,"merged":[]}

{"sheet":"Sheet9","index":10,"n_rows":0,"n_cols":0,"rows_kept":0,"cut":false,"hidden":false,"merged":[]}

{"sheet":"Sheet10","index":11,"n_rows":0,"n_cols":0,"rows_kept":0,"cut":false,"hidden":false,"merged":[]}